Player,Position,ProTeam,RotoTeam,RVid,MLBAMID,BDBID,RotoValue,bG,bAB,bH,bHR,bR,bRBI,bSB,bAvg,pG,pIP,pH,pK,pBB,pER,pWin,pSav,pWHIP,pERA
José Ramírez,3B,Guardians,,6941,608070,ramirjo01,$0.00,157,601,168,29,90,126,20,.280,,,,,,,,,,
Amed Rosario,SS,Guardians,,10972,642708,,$-0.00,153,637,180,11,86,71,18,.283,,,,,,,,,,
Andrés Giménez,2B,Guardians,,12387,665926,,$-0.00,146,491,146,17,66,69,20,.297,,,,,,,,,,
Steven Kwan,LF,Guardians,,13364,680757,,$-0.00,147,563,168,6,89,52,19,.298,,,,,,,,,,
Shane Bieber,SP,Guardians,,12267,669456,,$-0.00,,,,,,,,,31,200.00,172,198,36,64,13,,1.040,2.88
Emmanuel Clase,RP,Guardians,,12974,661403,,$0.00,,,,,,,,,77,72.67,43,77,10,11,3,42,0.729,1.36
Triston McKenzie,SP,Guardians,,13027,663474,,$-0.00,,,,,,,,,31,191.33,138,190,44,63,11,,0.951,2.96
Josh Naylor,None,Guardians,,11973,647304,,$-0.00,122,449,115,20,47,79,6,.256,,,,,,,,,,
Cal Quantrill,SP,Guardians,,12633,615698,,$-0.00,,,,,,,,,32,186.33,178,128,47,70,15,,1.208,3.38
Myles Straw,CF,Guardians,,11977,664702,,$-0.00,152,535,118,,72,32,21,.221,,,,,,,,,,
Oscar Gonzalez,LF,Guardians,,12730,,,$-0.00,91,362,107,11,39,43,1,.296,,,,,,,,,,
Owen Miller,None,Guardians,,12638,680911,,$-0.00,130,424,103,6,53,51,2,.243,,,,,,,,,,
Franmil Reyes,None,Guardians,,7603,614177,,$-0.00,118,438,97,14,43,47,2,.221,1,1.00,,1,,,,,,
Trevor Stephan,SP,Guardians,,12435,663986,,$-0.00,,,,,,,,,66,63.67,57,82,18,19,6,3,1.178,2.69
Eli Morgan,SP,Guardians,,13395,669212,,$-0.00,,,,,,,,,50,66.67,46,72,13,25,5,,0.885,3.38
Sam Hentges,RP,Guardians,,12344,656529,,$-0.00,,,,,,,,,57,62.00,41,72,19,16,3,1,0.968,2.32
Enyel De Los Santos,SP,Guardians,,12277,660853,,$-0.00,1,,,,,,,,50,53.33,40,61,17,18,5,1,1.069,3.04
James Karinchak,RP,Guardians,,12411,675916,,$-0.00,,,,,,,,,38,39.00,22,62,21,9,2,3,1.103,2.08
Aaron Civale,SP,Guardians,,10738,650644,,$-0.00,,,,,,,,,20,97.00,93,98,22,53,5,,1.186,4.92
Nick Sandlin,RP,Guardians,,13527,680704,,$-0.00,,,,,,,,,46,44.00,27,41,24,11,5,,1.159,2.25
Zach Plesac,SP,Guardians,,12956,668676,,$-0.00,,,,,,,,,25,131.67,136,100,38,63,3,,1.322,4.31
Bryan Shaw,RP,Guardians,,3625,543766,shawbr01,$-0.00,1,,,,,,,,60,58.33,58,52,26,35,6,1,1.440,5.40
Óscar Mercado,None,Guardians,,11432,640458,,$-0.00,55,121,25,4,17,16,2,.207,,,,,,,,,,
Austin Hedges,C,Guardians,,6232,595978,,$-0.00,105,294,48,7,26,30,2,.163,,,,,,,,,,
Luke Maile,C,Guardians,,7442,571912,,$-0.00,76,181,40,3,19,17,,.221,,,,,,,,,,
Kirk McCarty,RP,Guardians,,13793,,,$-0.00,,,,,,,,,13,37.67,37,26,13,19,4,,1.327,4.54
Will Brennan,CF,Guardians,,14208,686823,,$-0.00,11,42,15,1,6,8,2,.357,,,,,,,,,,
Anthony Gose,RP,Guardians,,5104,543238,gosean01,$-0.00,,,,,,,,,22,21.00,15,28,14,11,3,,1.381,4.71
Nolan Jones,3B,Guardians,,12142,666134,,$-0.00,28,86,21,2,10,13,,.244,,,,,,,,,,
Yu Chang,None,Guardians,,10827,644374,,$-0.00,69,168,35,4,19,15,,.208,2,2.00,6,,,3,,,3.000,13.50
Cody Morris,SP,Guardians,,13895,663752,,$-0.00,,,,,,,,,7,23.67,21,23,12,6,1,,1.394,2.28
Konnor Pilkington,SP,Guardians,,13351,,,$-0.00,,,,,,,,,15,58.00,53,50,32,25,1,,1.466,3.88
Richie Palacios,SS,Guardians,,13805,680700,,$-0.00,54,112,26,,7,10,2,.232,,,,,,,,,,
Tyler Freeman,SS,Guardians,,12571,671289,,$-0.00,24,77,19,,9,3,1,.247,,,,,,,,,,
Gabriel Arias,3B,Guardians,,10848,672356,,$-0.00,16,47,9,1,9,5,1,.191,,,,,,,,,,
Will Benson,RF,Guardians,,11809,666181,,$-0.00,28,55,10,,8,3,,.182,,,,,,,,,,
Ernie Clement,SS,Guardians,,12410,676391,,$-0.00,69,163,30,,19,6,,.184,2,2.00,6,,,4,,,3.000,18.00
Logan Allen,SP,Guardians,,12747,663531,,$-0.00,,,,,,,,,7,7.67,12,7,5,5,1,,2.217,5.87
Jhonkensy Noel,3B,Guardians,,13894,678877,,$-0.00,,,,,,,,,,,,,,,,,,
Brayan Rocchio,SS,Guardians,,12851,677587,,$-0.00,,,,,,,,,,,,,,,,,,
José Tena,SS,Guardians,,12891,677588,,$-0.00,,,,,,,,,,,,,,,,,,
George Valera,CF,Guardians,,13378,671655,,$-0.00,,,,,,,,,,,,,,,,,,
Carlos Vargas,SP,Guardians,,13644,672841,,$-0.00,,,,,,,,,,,,,,,,,,
Bobby Bradley,1B,Guardians,,11714,656252,,$-0.00,8,17,2,,1,,,.118,,,,,,,,,,
Bryan Lavastida,C,Guardians,,13706,,,$-0.00,6,12,1,,,,,.083,,,,,,,,,,
Bo Naylor,C,Guardians,,12882,666310,,$-0.00,5,8,,,,,,,,,,,,,,,,
Tanner Tully,SP,Guardians,,13972,,,$-0.00,,,,,,,,,3,6.00,8,2,6,4,,,2.333,6.00
Xzavion Curry,SP,Guardians,,14828,675540,,$-0.00,,,,,,,,,2,9.33,13,3,6,6,,,2.036,5.79
Anthony Castro,SP,Guardians,,12045,621593,,$-0.00,,,,,,,,,12,13.33,19,12,10,11,,,2.175,7.42
Hunter Gaddis,RP,Guardians,,14822,683769,,$-0.00,,,,,,,,,2,7.33,15,5,3,15,,,2.455,18.41
