Player,Position,ProTeam,RotoTeam,RVid,pG,pPaYd,pPaTd,pPaConv,pPaInt,pSacked,kG,kFGM,kFGA,kXPM,kXPA,gG,gRuYd,gRuTd,gRuConv,gRuRecYd,tG,tDefTd,tInt,tSafety,rG,rRec,rTarget,rRec%,rReYd,rReTd,rReConv
Anthony Allen,RB,Ravens,,3058,,,,,,,,,,,,4,61,1,,73,,,,,4,2,4,50.0,12,,
Armando Allen,RB,Bears,,3391,,,,,,,,,,,,9,124,1,,140,,,,,2,2,3,66.7,16,,
Edwin Baker,RB,Chargers,,4535,,,,,,,,,,,,,,,,,,,,,,,,,,,
Lance Ball,RB,Broncos,,1282,,,,,,,,,,,,9,158,1,,219,,,,,5,7,11,63.6,61,1,
Vick Ballard,RB,Colts,,4628,,,,,,,,,,,,16,814,2,,966,,,,,13,17,27,63.0,152,1,
Baron Batch,RB,Steelers,,3075,,,,,,,,,,,,8,49,1,,80,,,,,4,4,5,80.0,31,,
Jackie Battle,RB,Chargers,,409,,,,,,,,,,,,14,311,3,,419,,,,,7,15,15,100.0,108,1,
Joique Bell,RB,Lions,,3,,,,,,,,,,,,16,414,3,,899,,,,,15,52,69,75.4,485,,
Kahlil Bell,RB,Bears,,1135,,,,,,,,,,,,4,76,,,89,,,,,2,2,2,100.0,13,,
Cedric Benson,RB,Packers,,807,,,,,,,,,,,,5,248,1,,345,,,,,4,14,15,93.3,97,,
Damien Berry,RB,Ravens,,3408,,,,,,,,,,,,,,,,,,,,,,,,,,,
Jahvid Best,RB,Lions,,2869,,,,,,,,,,,,,,,,,,,,,,,,,,,
LeGarrette Blount,RB,Buccanneers,,2081,,,,,,,,,,,,10,151,2,,153,,,,,2,1,2,50.0,2,,
Brandon Bolden,RB,Patriots,,4513,,,,,,,,,,,,8,274,2,,285,,,,,2,2,2,100.0,11,,
Lorenzo Booker,RB,Bears,,2963,,,,,,,,,,,,,,,,,,,,,,,,,,,
Ahmad Bradshaw,RB,Giants,,2521,,,,,,,,,,,,14,1015,6,,1260,,,,,11,23,31,74.2,245,,
Curtis Brinkley,RB,Chargers,,1922,,,,,,,,,,,,6,115,,,192,,,,,5,12,15,80.0,77,,
Aaron Brown,RB,Bengals,,87,,,,,,,,,,,,,,,,,,,,,,,,,,,
Andre Brown,RB,Giants,,2524,,,,,,,,,,,,8,385,8,1,471,,,,,6,12,17,70.6,86,,
Bryce Brown,RB,Eagles,,4566,,,,,,,,,,,,16,564,4,,620,,,,,6,13,19,68.4,56,,
Donald Brown,RB,Colts,,735,,,,,,,,,,,,9,417,1,1,510,,,,,9,9,13,69.2,93,,
Ronnie Brown,RB,Chargers,,2262,,,,,,,,,,,,12,220,,,591,,,,,14,49,59,83.1,371,,
Michael Bush,RB,Bears,,1213,,,,,,,,,,,,13,411,5,,494,,,,,8,9,11,81.8,83,,
Reggie Bush,RB,Dolphins,,251,,,,,,,,,,,,16,986,6,,1278,,,,,16,35,52,67.3,292,2,
Travaris Cadet,RB,Saints,,4235,,,,,,,,,,,,1,5,,,49,,,,,3,5,8,62.5,44,,
Delone Carter,RB,Colts,,3089,,,,,,,,,,,,7,122,3,,135,,,,,2,1,2,50.0,13,,
Jamaal Charles,RB,Chiefs,,418,,,,,,,,,,,,16,1509,5,,1745,,,,,13,35,48,72.9,236,1,
Tashard Choice,RB,Bills,,1603,,,,,,,,,,,,8,193,1,,202,,,,,4,4,9,44.4,9,,
John Conner,RB,Bengals,,2632,,,,,,,,,,,,,,,,,,,,,2,,2,,,,
Mike Cox,RB,Falcons,,4862,,,,,,,,,,,,,,,,,,,,,,,,,,,
Tristan Davis,RB,Redskins,,2272,,,,,,,,,,,,,,,,,,,,,,,,,,,
Jeff Demps,RB,Patriots,,4854,,,,,,,,,,,,,,,,,,,,,,,,,,,
James Develin,RB,Patriots,,2981,,,,,,,,,,,,,,,,,,,,,,,,,,,
Anthony Dixon,RB,49ers,,2638,,,,,,,,,,,,8,78,2,,78,,,,,,,,,,,
Shaun Draughn,RB,Chiefs,,3530,,,,,,,,,,,,13,233,2,,391,,,,,12,24,30,80.0,158,,
Lance Dunbar,RB,Cowboys,,4069,,,,,,,,,,,,5,75,,,108,,,,,4,6,12,50.0,33,,
Jonathan Dwyer,RB,Steelers,,2646,,,,,,,,,,,,13,623,2,,729,,,,,11,18,25,72.0,106,,
Nate Eachus,RB,Chiefs,,4177,,,,,,,,,,,,1,18,,,37,,,,,2,1,3,33.3,19,,
Darren Evans,RB,Titans,,3888,,,,,,,,,,,,,,,,,,,,,,,,,,,
Mario Fannin,RB,Broncos,,3269,,,,,,,,,,,,,,,,,,,,,,,,,,,
Justin Forsett,RB,Texans,,504,,,,,,,,,,,,11,374,1,,412,,,,,4,3,5,60.0,38,,
Matt Forte,RB,Bears,,1146,,,,,,,,,,,,15,1094,5,,1434,,,,,15,44,60,73.3,340,1,
Arian Foster,RB,Texans,,1375,,,,,,,,,,,,16,1424,15,,1641,,,,,16,40,58,69.0,217,2,
Terrance Ganaway,RB,Rams,,4835,,,,,,,,,,,,,,,,,,,,,,,,,,,
Toby Gerhart,RB,Vikings,,2853,,,,,,,,,,,,14,169,1,,324,,,,,13,20,27,74.1,155,,
Mike Goodson,RB,Raiders,,2180,,,,,,,,,,,,10,221,,,416,,,,,7,16,16,100.0,195,1,
Frank Gore,RB,49ers,,1536,,,,,,,,,,,,16,1214,8,,1448,,,,,14,28,36,77.8,234,1,
Ryan Grant,RB,Packers,,674,,,,,,,,,,,,5,132,2,,166,,,,,1,1,2,50.0,34,,
Cyrus Gray,RB,Chiefs,,4538,,,,,,,,,,,,3,44,,,62,,,,,3,2,3,66.7,18,,
Jonas Gray,RB,Dolphins,,4204,,,,,,,,,,,,,,,,,,,,,,,,,,,
Alex Green,RB,Packers,,3185,,,,,,,,,,,,10,464,,,589,,,,,9,18,29,62.1,125,,
BenJarvus Green-Ellis,RB,Bengals,,993,,,,,,,,,,,,15,1094,6,,1198,,,,,14,22,29,75.9,104,,
Shonn Greene,RB,Jets,,353,,,,,,,,,,,,16,1063,8,,1214,,,,,10,19,30,63.3,151,,
John Griffin,RB,Jets,,3444,,,,,,,,,,,,,,,,,,,,,,,,,,,
Jonathan Grimes,RB,Jaguars,,4125,,,,,,,,,,,,2,6,,,13,,,,,2,2,2,100.0,7,,
Chris Gronkowski,RB,Broncos,,1615,,,,,,,,,,,,,,,,11,,,,,1,1,1,100.0,11,,
Jewel Hampton,RB,49ers,,4326,,,,,,,,,,,,,,,,,,,,,,,,,,,
Montario Hardesty,RB,Browns,,2799,,,,,,,,,,,,10,271,1,,287,,,,,5,2,5,40.0,16,,
Jamie Harper,RB,Titans,,3103,,,,,,,,,,,,6,30,3,,38,,,,,1,1,1,100.0,8,,
DuJuan Harris,RB,Packers,,3363,,,,,,,,,,,,4,157,2,,174,,,,,1,2,2,100.0,17,,
Roy Helu Jr.,RB,Redskins,,3163,,,,,,,,,,,,1,2,,,47,,,,,3,7,7,100.0,45,,
Dan Herron,RB,Bengals,,4671,,,,,,,,,,,,2,5,,,5,,,,,1,,1,,,,
Lex Hilliard,RB,Jets,,2289,,,,,,,,,,,,5,33,,,56,,,,,7,4,9,44.4,23,,
Peyton Hillis,RB,Chiefs,,1861,1,,,,,,,,,,,13,309,1,,371,,,,,10,10,14,71.4,62,,
Ronnie Hillman,RB,Broncos,,4802,,,,,,,,,,,,14,330,1,,392,,,,,9,10,12,83.3,62,,
Robert Hughes,RB,Colts,,3302,,,,,,,,,,,,1,5,,,8,,,,,1,1,1,100.0,3,,
Kendall Hunter,RB,49ers,,3249,1,,,,,1,,,,,,11,371,2,,431,,,,,9,9,12,75.0,60,,
Mark Ingram,RB,Saints,,3218,,,,,,,,,,,,16,602,5,,631,,,,,9,6,10,60.0,29,,
Chris Ivory,RB,Saints,,283,,,,,,,,,,,,6,217,2,,232,,,,,3,2,3,66.7,15,,
Brandon Jackson,RB,Browns,,680,,,,,,,,,,,,1,54,,,74,,,,,1,2,4,50.0,20,,
Fred Jackson,RB,Bills,,36,,,,,,,,,,,,10,437,3,,654,,,,,9,34,42,81.0,217,1,
Steven Jackson,RB,Rams,,2376,,,,,,,,,,,,16,1042,4,,1363,,,,,13,38,53,71.7,321,,1
Brandon Jacobs,RB,49ers,,2545,,,,,,,,,,,,2,7,,,7,,,,,,,,,,,
Javarris James,RB,Cardinals,,761,,,,,,,,,,,,,,,,,,,,,,,,,,,
LaMichael James,RB,49ers,,4501,,,,,,,,,,,,4,125,,,154,,,,,3,3,5,60.0,29,,
Rashad Jennings,RB,Jaguars,,2448,,,,,,,,,,,,10,283,2,,413,,,,,8,19,26,73.1,130,,1
Chris Johnson,RB,Titans,,2107,,,,,,,,,,,,16,1243,6,,1475,,,,,15,36,49,73.5,232,,
Felix Jones,RB,Cowboys,,1630,,,,,,,,,,,,14,402,3,,664,,,,,12,25,36,69.4,262,2,
Taiwan Jones,RB,Raiders,,3130,,,,,,,,,,,,3,21,,,32,,,,,2,2,2,100.0,11,,
Maurice Jones-Drew,RB,Jaguars,,2450,,,,,,,,,,,,6,414,1,,500,,,,,5,14,18,77.8,86,1,
Deji Karim,RB,Colts,,2792,,,,,,,,,,,,,,,,,,,,,,,,,,,
Eric Kettani,RB,Patriots,,3698,,,,,,,,,,,,,,,,,,,,,,,,,,,
Brian Leonard,RB,Bengals,,840,,,,,,,,,,,,9,106,,,173,,,,,9,11,15,73.3,67,,
Mikel Leshoure,RB,Lions,,3181,,,,,,,,,,,,14,798,9,,1012,,,,,13,34,48,70.8,214,,
Dion Lewis,RB,Eagles,,3154,,,,,,,,,,,,6,69,1,,93,,,,,2,2,2,100.0,24,,
Kregg Lumpkin,RB,Giants,,695,,,,,,,,,,,,1,42,,,42,,,,,2,,2,,,,
Marshawn Lynch,RB,Seahawks,,47,,,,,,,,,,,,16,1590,11,,1786,,,,,15,23,30,76.7,196,1,
Doug Martin,RB,Buccanneers,,4701,,,,,,,,,,,,16,1454,11,,1926,,,,,16,49,70,70.0,472,1,
Joe Martinek,RB,Giants,,4251,,,,,,,,,,,,,,,,,,,,,,,,,,,
Ryan Mathews,RB,Chargers,,2855,,,,,,,,,,,,12,707,1,,959,,,,,12,39,56,69.6,252,,
LeSean McCoy,RB,Eagles,,2044,,,,,,,,,,,,12,840,2,,1213,,,,,12,54,67,80.6,373,3,
Darren McFadden,RB,Raiders,,1243,,,,,,,,,,,,12,707,2,,965,,,,,12,42,63,66.7,258,1,
Willis McGahee,RB,Broncos,,1713,,,,,,,,,,,,10,731,4,,952,,,,,10,26,33,78.8,221,,1
Joe McKnight,RB,Jets,,2684,,,,,,,,,,,,12,179,,,197,,,,,1,1,2,50.0,18,,
Rashard Mendenhall,RB,Steelers,,208,,,,,,,,,,,,6,182,,,244,,,,,4,9,11,81.8,62,1,
Brit Miller,RB,Rams,,1555,,,,,,,,,,,,,,,,,,,,,3,,3,,,,
Lamar Miller,RB,Dolphins,,4689,,,,,,,,,,,,9,250,1,,295,,,,,5,6,8,75.0,45,,
Mewelde Moore,RB,Colts,,210,,,,,,,,,,,,5,20,,,97,,,,,6,6,8,75.0,77,1,
Knowshon Moreno,RB,Broncos,,1327,,,,,,,,,,,,8,525,4,,692,,,,,7,21,26,80.8,167,,
Alfred Morris,RB,Redskins,,4428,,,,,,,,,,,,16,1613,13,,1690,,,,,11,11,16,68.8,77,,
Richard Murphy,RB,Jaguars,,3687,,,,,,,,,,,,4,92,,,92,,,,,1,,1,,,,
DeMarco Murray,RB,Cowboys,,3146,,,,,,,,,,,,10,663,4,,914,,,,,10,35,42,83.3,251,,
Dimitri Nance,RB,Falcons,,929,,,,,,,,,,,,,,,,,,,,,,,,,,,
Chris Ogbonnaya,RB,Browns,,2393,,,,,,,,,,,,7,30,,,217,,,,,10,24,32,75.0,187,,
Jamize Olawale,RB,Raiders,,4726,,,,,,,,,,,,,,,,,,,,,,,,,,,
Montell Owens,RB,Jaguars,,2475,,,,,,,,,,,,4,209,1,1,322,,,,,5,8,10,80.0,113,,
Jalen Parmele,RB,Jaguars,,1721,,,,,,,,,,,,5,143,,,203,,,,,6,7,9,77.8,60,,
Isaiah Pead,RB,Rams,,4745,,,,,,,,,,,,4,54,,,70,,,,,4,3,4,75.0,16,,
Cedric Peerman,RB,Bengals,,858,,,,,,,,,,,,10,258,1,,343,,,,,2,9,9,100.0,85,,
Adrian Peterson,RB,Vikings,,1101,,,,,,,,,,,,16,2097,12,1,2314,,,,,15,40,51,78.4,217,1,
Bernard Pierce,RB,Ravens,,4489,,,,,,,,,,,,15,532,1,,579,,,,,7,7,11,63.6,47,,
Chris Polk,RB,Eagles,,4285,,,,,,,,,,,,,,,,,,,,,,,,,,,
Tauren Poole,RB,Panthers,,4006,,,,,,,,,,,,,,,,,,,,,,,,,,,
Bilal Powell,RB,Jets,,3056,,,,,,,,,,,,14,437,4,,577,,,,,13,17,36,47.2,140,,
William Powell,RB,Cardinals,,3508,,,,,,,,,,,,12,216,,,348,,,,,8,19,25,76.0,132,,
Bobby Rainey,RB,Ravens,,3991,,,,,,,,,,,,,,,,,,,,,,,,,,,
Chris Rainey,RB,Steelers,,4418,,,,,,,,,,,,11,102,2,,162,,,,,12,14,22,63.6,60,,
Isaac Redman,RB,Steelers,,216,,,,,,,,,,,,14,410,2,,654,,,,,12,19,23,82.6,244,,
Marcel Reece,RB,Raiders,,1256,,,,,,,,,,,,6,271,,,767,,,,,15,52,73,71.2,496,1,
Darius Reynaud,RB,Titans,,1103,,,,,,,,,,,,9,33,,,68,,,,,4,5,9,55.6,35,,
Ray Rice,RB,Ravens,,1729,,,,,,,,,,,,16,1143,9,,1621,,,,,15,61,83,73.5,478,1,
Daryl Richardson,RB,Rams,,4695,,,,,,,,,,,,16,475,,1,638,,,,,13,24,36,66.7,163,,
Trent Richardson,RB,Browns,,4795,,,,,,,,,,,,15,950,11,,1317,,,,,15,51,70,72.9,367,1,
Stevan Ridley,RB,Patriots,,3047,,,,,,,,,,,,16,1263,12,,1314,,,,,7,6,14,42.9,51,,
Javon Ringer,RB,Titans,,2131,,,,,,,,,,,,1,14,,,26,,,,,1,3,5,60.0,12,,
Michael Robinson,RB,Seahawks,,1564,,,,,,,,,,,,8,49,,,175,,,,,9,13,15,86.7,126,2,
Jacquizz Rodgers,RB,Falcons,,3208,,,,,,,,,,,,16,362,1,,764,,,,,16,53,59,89.8,402,1,
Evan Royster,RB,Redskins,,3170,,,,,,,,,,,,12,88,2,,197,,,,,10,15,23,65.2,109,,
Brandon Saine,RB,Packers,,3770,,,,,,,,,,,,,,,,,,,,,,,,,,,
Owen Schmitt,RB,Raiders,,548,,,,,,,,,,,,2,1,,,1,,,,,,,,,,,
Bernard Scott,RB,Bengals,,869,,,,,,,,,,,,2,35,,,35,,,,,,,,,,,
Da'Rel Scott,RB,Giants,,3389,,,,,,,,,,,,1,9,,,9,,,,,,,,,,,
Alfonso Smith,RB,Cardinals,,1812,,,,,,,,,,,,,,,,21,,,,,2,2,3,66.7,21,,
Antone Smith,RB,Falcons,,946,,,,,,,,,,,,,,,,,,,,,1,,1,,,,
Armond Smith,RB,Panthers,,3461,,,,,,,,,,,,1,,,,,,,,,,,,,,,
Kevin Smith,RB,Lions,,151,,,,,,,,,,,,6,134,1,,213,,,,,8,10,16,62.5,79,1,
Michael Smith,RB,Buccanneers,,4447,,,,,,,,,,,,,,,,,,,,,,,,,,,
Jason Snelling,RB,Falcons,,947,,,,,,,,,,,,10,63,,,266,,,,,14,31,35,88.6,203,1,
C.J. Spiller,RB,Bills,,2759,,,,,,,,,,,,16,1244,6,,1703,,,,,16,43,57,75.4,459,2,
Darren Sproles,RB,Saints,,1984,,,,,,,,,,,,10,244,1,1,911,,,,,13,75,104,72.1,667,7,
James Starks,RB,Packers,,2692,,,,,,,,,,,,6,255,1,,286,,,,,4,4,6,66.7,31,,
LaRod Stephens-Howling,RB,Cardinals,,1814,,,,,,,,,,,,14,357,4,,463,,,,,12,17,30,56.7,106,,
Jonathan Stewart,RB,Panthers,,2222,,,,,,,,,,,,9,336,1,,493,,,,,9,17,23,73.9,157,1,
Phillip Tanner,RB,Cowboys,,3871,,,,,,,,,,,,4,61,,,102,,,,,3,4,5,80.0,41,,
Ben Tate,RB,Texans,,2843,,,,,,,,,,,,11,279,2,,328,,,,,5,11,11,100.0,49,,
Marcus Thigpen,RB,Dolphins,,3937,,,,,,,,,,,,1,8,,,23,,,,,1,1,2,50.0,15,,
Daniel Thomas,RB,Dolphins,,3041,,,,,,,,,,,,12,325,4,,481,,,,,9,15,22,68.2,156,,
Pierre Thomas,RB,Saints,,317,,,,,,,,,,,,15,473,1,,827,,,,,15,39,53,73.6,354,1,
Jordan Todman,RB,Jaguars,,3140,,,,,,,,,,,,1,8,,,8,,,,,1,1,1,100.0,,,
Ryan Torain,RB,Giants,,1499,,,,,,,,,,,,,,,,,,,,,,,,,,,
Keith Toston,RB,Jaguars,,2406,,,,,,,,,,,,1,74,,,115,,,,,1,3,4,75.0,41,,
Robert Turbin,RB,Seahawks,,4609,,,,,,,,,,,,15,354,,,535,,,,,13,19,23,82.6,181,,
Michael Turner,RB,Falcons,,951,,,,,,,,,,,,16,800,10,,928,,,,,13,19,30,63.3,128,1,
Harvey Unga,RB,Bears,,2779,,,,,,,,,,,,,,,,,,,,,,,,,,,
Shane Vereen,RB,Patriots,,3050,,,,,,,,,,,,10,251,3,,400,,,,,9,8,13,61.5,149,1,
D.J. Ware,RB,Buccanneers,,2582,,,,,,,,,,,,10,51,,,151,,,,,11,14,20,70.0,100,,
Leon Washington,RB,Seahawks,,560,,,,,,,,,,,,9,83,1,,114,,,,,5,4,8,50.0,31,,
Beanie Wells,RB,Cardinals,,1823,,,,,,,,,,,,8,234,5,,258,,,,,1,1,1,100.0,24,,
Johnny White,RB,Packers,,3035,,,,,,,,,,,,3,34,,,34,,,,,,,,,,,
DeAngelo Williams,RB,Panthers,,2232,,,,,,,,,,,,16,737,5,,924,,,,,11,13,20,65.0,187,2,
Keiland Williams,RB,Redskins,,1507,,,,,,,,,,,,2,3,,,12,,,,,2,2,2,100.0,9,,
Ryan Williams,RB,Cardinals,,3238,,,,,,,,,,,,5,164,,,208,,,,,5,7,10,70.0,44,,
David Wilson,RB,Giants,,4506,,,,,,,,,,,,13,358,4,,392,,,,,6,4,9,44.4,34,1,
Danny Woodhead,RB,Patriots,,404,,,,,,,,,,,,14,301,4,,747,,,,,14,40,55,72.7,446,3,
