Player,Position,ProTeam,RotoTeam,RVid,MLBAMID,BDBID,RotoValue,bG,bAB,bH,b2B,b3B,bHR,bRBOE,bR,bRBI,bSB,bCS,bBB,bIBB,bHBP,bSF,bSH,bAvg,bOBP,bSlg,bwOBA,pG,pIP,pH,pHR,pK,pBB,pIBB,pHB,pER,pWin,pL,pSav,pWHIP,pERA,pFIP
Clayton Kershaw,SP,Dodgers,,4603,477132,kershcl01,$52.14,,,,,,,,,,,,,,,,,,,,,33,232.67,163,15,301,42,1,5,55,16,7,,0.881,2.13,1.94
Zack Greinke,SP,Dodgers,,1355,425844,greinza01,$50.36,,,,,,,,,,,,,,,,,,,,,32,222.67,148,14,200,40,1,5,41,19,3,,0.844,1.66,2.71
Adrián González,1B,Dodgers,,3959,408236,gonzaad01,$15.10,156,571,157,33,,28,5,76,90,,1,62,10,6,3,,.275,.350,.480,.361,,,,,,,,,,,,,,,
Kenley Jansen,RP,Dodgers,,4575,445276,janseke01,$11.87,,,,,,,,,,,,,,,,,,,,,54,52.33,33,6,80,8,,2,14,2,1,36,0.783,2.41,2.11
Alex Wood,SP,Dodgers,,6214,622072,woodal02,$1.67,,,,,,,,,,,,,,,,,,,,,32,189.67,198,15,139,59,4,4,81,12,12,,1.355,3.84,3.60
Justin Turner,3B,Dodgers,,446,457759,turneju01,$1.67,126,385,113,26,1,16,1,55,60,5,2,36,1,13,4,1,.294,.369,.491,.375,,,,,,,,,,,,,,,
Howie Kendrick,2B,Dodgers,,1679,435062,kendrho01,$1.00,117,464,137,22,2,9,4,64,54,6,2,27,1,2,1,1,.295,.335,.409,.337,,,,,,,,,,,,,,,
Andre Ethier,CF/LF/RF,Dodgers,,4708,444843,ethiean01,$1.00,142,395,116,20,7,14,3,54,53,2,3,43,2,4,3,,.294,.366,.486,.372,,,,,,,,,,,,,,,
Yasmani Grandal,1B/C,Dodgers,,4985,518735,grandya01,$1.00,115,355,83,12,,16,,43,47,,1,65,1,2,3,1,.234,.352,.403,.335,,,,,,,,,,,,,,,
Brett Anderson,SP,Dodgers,,4778,474463,anderbr04,$1.00,,,,,,,,,,,,,,,,,,,,,31,180.33,194,18,116,46,2,2,74,10,9,,1.331,3.69,3.88
Jimmy Rollins,SS,Dodgers,,2345,276519,rolliji01,$-1.86,144,517,116,24,3,13,3,71,41,12,8,44,,,1,1,.224,.284,.358,.288,,,,,,,,,,,,,,,
Joc Pederson,CF,Dodgers,,5344,592626,,$-2.19,151,480,101,19,1,26,2,67,54,4,7,92,6,9,2,2,.210,.345,.417,.334,,,,,,,,,,,,,,,
Mike Bolsinger,SP,Dodgers,,6454,502211,,$-5.16,,,,,,,,,,,,,,,,,,,,,21,109.33,104,11,98,45,3,1,44,6,6,,1.363,3.62,3.80
Yimi García,RP/SP,Dodgers,,6811,554340,,$-6.59,,,,,,,,,,,,,,,,,,,,,59,56.67,44,8,68,10,1,2,21,3,5,1,0.953,3.34,3.12
J.P. Howell,RP,Dodgers,,528,434442,howeljp01,$-7.49,,,,,,,,,,,,,,,,,,,,,65,44.00,47,3,39,14,1,2,7,6,1,1,1.386,1.43,3.24
Pedro Báez,RP,Dodgers,,4657,520980,,$-8.80,,,,,,,,,,,,,,,,,,,,,52,51.00,47,4,60,11,1,1,19,4,2,,1.137,3.35,2.41
A.J. Ellis,C,Dodgers,,4622,454560,ellisaj01,$-10.29,63,181,43,9,,7,1,24,21,,,32,1,1,,3,.238,.350,.403,.342,,,,,,,,,,,,,,,
Chris Hatcher,RP,Dodgers,,4924,501822,hatchch02,$-10.87,,,,,,,,,,,,,,,,,,,,,49,39.00,35,4,45,13,2,3,16,3,5,4,1.231,3.69,3.20
Jim Johnson,RP,Dodgers,,381,462382,johnsji04,$-12.30,,,,,,,,,,,,,,,,,,,,,72,66.67,77,5,50,20,2,5,33,2,6,10,1.455,4.46,3.61
Luis Avilán,RP,Dodgers,,5382,501593,avilalu01,$-13.56,,,,,,,,,,,,,,,,,,,,,73,53.33,48,6,49,15,2,1,24,2,5,,1.181,4.05,3.51
Joel Peralta,RP,Dodgers,,2434,407908,peraljo01,$-14.02,,,,,,,,,,,,,,,,,,,,,33,29.00,28,6,24,8,1,,14,3,1,3,1.241,4.34,4.86
Carlos Frias,RP,Dodgers,,7452,516910,,$-14.17,,,,,,,,,,,,,,,,,,,,,17,77.67,88,7,43,26,1,3,35,5,5,,1.468,4.06,4.25
Yasiel Puig,CF/RF,Dodgers,,6130,624577,puigya01,$-14.39,79,282,72,12,3,11,1,30,38,3,3,26,1,2,1,,.255,.322,.436,.330,,,,,,,,,,,,,,,
Brandon McCarthy,SP,Dodgers,,4437,435221,mccarbr01,$-15.42,,,,,,,,,,,,,,,,,,,,,4,23.00,24,9,29,4,,,15,3,,,1.217,5.87,6.19
Adam Liberatore,RP/SP,Dodgers,,6220,571893,,$-15.87,,,,,,,,,,,,,,,,,,,,,39,29.67,26,3,29,9,4,,14,2,2,,1.180,4.25,2.97
Juan Nicasio,RP,Dodgers,,3771,504379,nicasju01,$-16.44,,,,,,,,,,,,,,,,,,,,,53,58.33,59,1,65,32,6,1,25,1,3,1,1.560,3.86,2.48
Ian Thomas,RP,Dodgers,,7094,621962,,$-17.99,,,,,,,,,,,,,,,,,,,,,14,23.33,20,2,23,11,,,10,1,1,,1.329,3.86,3.66
Josh Ravin,SP,Dodgers,,6189,502051,,$-18.73,,,,,,,,,,,,,,,,,,,,,9,9.33,13,3,12,4,,1,7,2,1,,1.821,6.75,6.31
Corey Seager,SS,Dodgers,,6429,608369,,$-18.90,27,98,33,8,1,4,1,17,17,2,,14,1,1,,,.337,.425,.561,.436,,,,,,,,,,,,,,,
Chase Utley,2B,Dodgers,,2329,400284,utleych01,$-19.57,107,373,79,21,2,8,4,37,39,4,,32,4,10,8,,.212,.286,.343,.286,,,,,,,,,,,,,,,
Matt West,RP,Dodgers,,5537,519411,,$-20.38,,,,,,,,,,,,,,,,,,,,,2,3.00,2,,2,1,,,,,,,1.000,,2.77
Bronson Arroyo,SP,Dodgers,,2786,276520,arroybr01,$-20.42,,,,,,,,,,,,,,,,,,,,,,,,,,,,,,,,,,,3.10
Erik Bedard,SP,Dodgers,,4250,407853,bedarer01,$-20.42,,,,,,,,,,,,,,,,,,,,,,,,,,,,,,,,,,,3.10
Ramon Benjamin,SP,Dodgers,,5541,,,$-20.42,,,,,,,,,,,,,,,,,,,,,,,,,,,,,,,,,,,3.10
Jharel Cotton,SP,Dodgers,,10948,605194,,$-20.42,,,,,,,,,,,,,,,,,,,,,,,,,,,,,,,,,,,3.10
José De León,SP,Dodgers,,11093,592254,,$-20.42,,,,,,,,,,,,,,,,,,,,,,,,,,,,,,,,,,,3.10
Stephen Fife,SP,Dodgers,,5529,543155,fifest01,$-20.42,,,,,,,,,,,,,,,,,,,,,,,,,,,,,,,,,,,3.10
Freddy Garcia,SP,Dodgers,,862,150119,garcifr02,$-20.42,,,,,,,,,,,,,,,,,,,,,,,,,,,,,,,,,,,3.10
Blake Johnson,SP,Dodgers,,1304,455106,,$-20.42,,,,,,,,,,,,,,,,,,,,,,,,,,,,,,,,,,,3.10
Aaron Miller,SP,Dodgers,,4610,475572,,$-20.42,,,,,,,,,,,,,,,,,,,,,,,,,,,,,,,,,,,3.10
Red Patterson,SP,Dodgers,,6899,572017,,$-20.42,,,,,,,,,,,,,,,,,,,,,,,,,,,,,,,,,,,3.10
Dustin Richardson,SP,Dodgers,,83,450580,richadu02,$-20.42,,,,,,,,,,,,,,,,,,,,,,,,,,,,,,,,,,,3.10
Hyun Jin Ryu,SP,Dodgers,,6206,547943,ryuhy01,$-20.42,,,,,,,,,,,,,,,,,,,,,,,,,,,,,,,,,,,3.10
Alexander Santana,SP,Dodgers,,10521,,,$-20.42,,,,,,,,,,,,,,,,,,,,,,,,,,,,,,,,,,,3.10
Ian Snell,SP,Dodgers,,4272,430636,snellia01,$-20.42,,,,,,,,,,,,,,,,,,,,,,,,,,,,,,,,,,,3.10
Daniel Tillman,SP,Dodgers,,5644,534581,,$-20.42,,,,,,,,,,,,,,,,,,,,,,,,,,,,,,,,,,,3.10
Julio Urías,SP,Dodgers,,10018,628711,,$-20.42,,,,,,,,,,,,,,,,,,,,,,,,,,,,,,,,,,,3.10
P.J. Walters,SP,Dodgers,,3463,502208,waltepj01,$-20.42,,,,,,,,,,,,,,,,,,,,,,,,,,,,,,,,,,,3.10
Scott Baker,RP,Dodgers,,1496,435044,bakersc02,$-20.94,,,,,,,,,,,,,,,,,,,,,2,11.00,11,4,8,3,,,7,,1,,1.273,5.73,7.19
Juan Abreu,RP,Dodgers,,1803,444874,abreuju01,$-21.08,,,,,,,,,,,,,,,,,,,,,,,,,,,,,,,,,,,3.10
Mike Adams,RP,Dodgers,,3888,430606,adamsmi03,$-21.08,,,,,,,,,,,,,,,,,,,,,,,,,,,,,,,,,,,3.10
Jeff Bennett,RP,Dodgers,,517,430831,benneje01,$-21.08,,,,,,,,,,,,,,,,,,,,,,,,,,,,,,,,,,,3.10
Lisalverto Bonilla,RP,Dodgers,,5861,570810,,$-21.08,,,,,,,,,,,,,,,,,,,,,,,,,,,,,,,,,,,3.10
Ryan Buchter,RP,Dodgers,,2562,488748,,$-21.08,,,,,,,,,,,,,,,,,,,,,,,,,,,,,,,,,,,3.10
Brian Burgamy,RP,Dodgers,,9982,457810,,$-21.08,,,,,,,,,,,,,,,,,,,,,,,,,,,,,,,,,,,3.10
Robert Carson,RP,Dodgers,,5552,518533,carsoro01,$-21.08,,,,,,,,,,,,,,,,,,,,,,,,,,,,,,,,,,,3.10
Daniel Corcino,RP,Dodgers,,5610,542289,,$-21.08,,,,,,,,,,,,,,,,,,,,,,,,,,,,,,,,,,,3.10
Eury De La Rosa,RP,Dodgers,,6196,545001,delareu01,$-21.08,,,,,,,,,,,,,,,,,,,,,,,,,,,,,,,,,,,3.10
Jorge De Leon,RP,Dodgers,,4989,501529,deleojo02,$-21.08,,,,,,,,,,,,,,,,,,,,,,,,,,,,,,,,,,,3.10
Sam Demel,RP,Dodgers,,4756,451585,demelsa01,$-21.08,,,,,,,,,,,,,,,,,,,,,,,,,,,,,,,,,,,3.10
Ryan Dennick,RP,Dodgers,,7118,572810,,$-21.08,,,,,,,,,,,,,,,,,,,,,,,,,,,,,,,,,,,3.10
Steve Edlefsen,RP,Dodgers,,4085,453580,edlefst01,$-21.08,,,,,,,,,,,,,,,,,,,,,,,,,,,,,,,,,,,3.10
Barry Enright,RP,Dodgers,,3592,446264,enrigba01,$-21.08,,,,,,,,,,,,,,,,,,,,,,,,,,,,,,,,,,,3.10
Chad Gaudin,RP,Dodgers,,4761,429985,gaudich01,$-21.08,,,,,,,,,,,,,,,,,,,,,,,,,,,,,,,,,,,3.10
Jeremy Horst,RP,Dodgers,,2771,456662,horstje01,$-21.08,,,,,,,,,,,,,,,,,,,,,,,,,,,,,,,,,,,3.10
Michael Johnson,RP,Dodgers,,10949,,,$-21.08,,,,,,,,,,,,,,,,,,,,,,,,,,,,,,,,,,,3.10
Josh Judy,RP,Dodgers,,1023,518865,judyjo01,$-21.08,,,,,,,,,,,,,,,,,,,,,,,,,,,,,,,,,,,3.10
Brandon League,RP,Dodgers,,4231,434181,leagubr01,$-21.08,,,,,,,,,,,,,,,,,,,,,,,,,,,,,,,,,,,3.10
Kyler Newby,RP,Dodgers,,3605,460313,,$-21.08,,,,,,,,,,,,,,,,,,,,,,,,,,,,,,,,,,,3.10
Fu-Te Ni,RP,Dodgers,,1161,547820,nifu01,$-21.08,,,,,,,,,,,,,,,,,,,,,,,,,,,,,,,,,,,3.10
Anthony Ortega,RP,Dodgers,,1626,471162,ortegan01,$-21.08,,,,,,,,,,,,,,,,,,,,,,,,,,,,,,,,,,,3.10
B.J. Rosenberg,RP,Dodgers,,2272,543725,rosenbj01,$-21.08,,,,,,,,,,,,,,,,,,,,,,,,,,,,,,,,,,,3.10
Ryan Sadowski,RP,Dodgers,,2923,455961,sadowry01,$-21.08,,,,,,,,,,,,,,,,,,,,,,,,,,,,,,,,,,,3.10
Romulo Sanchez,RP,Dodgers,,243,454972,sanchro01,$-21.08,,,,,,,,,,,,,,,,,,,,,,,,,,,,,,,,,,,3.10
Anthony Slama,RP,Dodgers,,1508,460104,slamaan01,$-21.08,,,,,,,,,,,,,,,,,,,,,,,,,,,,,,,,,,,3.10
Henry Sosa,RP,Dodgers,,4077,464400,sosahe01,$-21.08,,,,,,,,,,,,,,,,,,,,,,,,,,,,,,,,,,,3.10
Michael Thomas,RP,Dodgers,,7075,607745,,$-21.08,,,,,,,,,,,,,,,,,,,,,,,,,,,,,,,,,,,3.10
Ramon Troncoso,RP,Dodgers,,4591,470462,troncra01,$-21.08,,,,,,,,,,,,,,,,,,,,,,,,,,,,,,,,,,,3.10
Sean White,RP,Dodgers,,4248,457461,whitese02,$-21.08,,,,,,,,,,,,,,,,,,,,,,,,,,,,,,,,,,,3.10
Brian Wilson,RP,Dodgers,,4079,451216,wilsobr01,$-21.08,,,,,,,,,,,,,,,,,,,,,,,,,,,,,,,,,,,3.10
Carl Crawford,LF,Dodgers,,605,408307,crawfca02,$-21.11,69,181,48,9,2,4,,19,16,10,2,10,1,,,,.265,.304,.403,.316,,,,,,,,,,,,,,,
Austin Barnes,C,Dodgers,,6547,605131,,$-21.16,20,29,6,2,,,,4,1,1,,6,,1,,1,.207,.351,.276,.312,,,,,,,,,,,,,,,
Eric Surkamp,RP,Dodgers,,5512,474668,surkaer01,$-21.55,,,,,,,,,,,,,,,,,,,,,1,3.33,4,2,4,1,,2,4,,,,1.500,10.80,11.20
Alex Guerrero,2B/3B/LF,Dodgers,,7345,648717,,$-21.58,106,219,51,9,1,11,3,25,36,1,,7,,2,2,,.233,.261,.434,.309,,,,,,,,,,,,,,,
Chin-Hui Tsao,SP,Dodgers,,10565,425835,,$-21.63,,,,,,,,,,,,,,,,,,,,,5,7.00,15,3,7,3,1,,8,1,1,,2.571,10.29,7.53
Joe Wieland,SP,Dodgers,,5626,543921,wielajo01,$-21.92,,,,,,,,,,,,,,,,,,,,,2,8.67,10,2,4,5,1,,8,,1,,1.731,8.31,6.56
Kiké Hernández,2B/LF,Dodgers,,5301,571771,,$-21.95,76,202,62,12,2,7,4,24,22,,2,11,,2,2,1,.307,.344,.490,.372,,,,,,,,,,,,,,,
Brandon Beachy,SP,Dodgers,,4980,545404,beachbr01,$-21.98,,,,,,,,,,,,,,,,,,,,,2,8.00,10,1,5,6,2,,7,,1,,2.000,7.88,4.97
Eliezer Alfonzo,C,Dodgers,,4277,425769,alfonel01,$-22.15,,,,,,,,,,,,,,,,,,,,,,,,,,,,,,,,,,,
Steve Cilladi,C,Dodgers,,7163,,,$-22.15,,,,,,,,,,,,,,,,,,,,,,,,,,,,,,,,,,,
Damaso Espino,C,Dodgers,,1039,451537,,$-22.15,,,,,,,,,,,,,,,,,,,,,,,,,,,,,,,,,,,
Ralph Henriquez,C,Dodgers,,4282,475894,,$-22.15,,,,,,,,,,,,,,,,,,,,,,,,,,,,,,,,,,,
Spencer Navin,C,Dodgers,,10996,,,$-22.15,,,,,,,,,,,,,,,,,,,,,,,,,,,,,,,,,,,
C.J. Retherford,C,Dodgers,,913,522728,,$-22.15,,,,,,,,,,,,,,,,,,,,,,,,,,,,,,,,,,,
Webster Rivas,C,Dodgers,,6566,593590,,$-22.15,,,,,,,,,,,,,,,,,,,,,,,,,,,,,,,,,,,
Ali Solis,C,Dodgers,,4880,455378,solisal01,$-22.15,,,,,,,,,,,,,,,,,,,,,,,,,,,,,,,,,,,
Jan Vazquez,C,Dodgers,,7164,572225,,$-22.15,,,,,,,,,,,,,,,,,,,,,,,,,,,,,,,,,,,
Matt Wallach,C,Dodgers,,4634,489405,,$-22.15,,,,,,,,,,,,,,,,,,,,,,,,,,,,,,,,,,,
Brian Ward,C,Dodgers,,5657,503424,,$-22.15,,,,,,,,,,,,,,,,,,,,,,,,,,,,,,,,,,,
Shawn Zarraga,C,Dodgers,,7189,519452,,$-22.15,,,,,,,,,,,,,,,,,,,,,,,,,,,,,,,,,,,
David Huff,RP,Dodgers,,1022,453307,huffda01,$-22.43,,,,,,,,,,,,,,,,,,,,,3,6.00,11,2,4,1,,1,6,,,,2.000,9.00,7.10
Justin Ruggiano,CF/LF/RF,Dodgers,,4910,448605,ruggiju01,$-23.10,57,125,31,8,1,6,2,20,15,5,2,14,,2,,,.248,.333,.472,.363,,,,,,,,,,,,,,,
Zach Lee,RP,Dodgers,,5831,545346,,$-23.27,,,,,,,,,,,,,,,,,,,,,1,4.67,11,1,3,1,,,7,,1,,2.571,13.50,5.24
Ryan Acosta,P,Dodgers,,6561,518391,,$-23.99,,,,,,,,,,,,,,,,,,,,,,,,,,,,,,,,,,,3.10
Geison Aguasviva,P,Dodgers,,6562,501253,,$-23.99,,,,,,,,,,,,,,,,,,,,,,,,,,,,,,,,,,,3.10
Chris Anderson,P,Dodgers,,9412,592108,,$-23.99,,,,,,,,,,,,,,,,,,,,,,,,,,,,,,,,,,,3.10
Fabio Castro,P,Dodgers,,37,466983,castrfa01,$-23.99,,,,,,,,,,,,,,,,,,,,,,,,,,,,,,,,,,,3.10
Eric Eadington,P,Dodgers,,5980,608578,,$-23.99,,,,,,,,,,,,,,,,,,,,,,,,,,,,,,,,,,,3.10
Randy Fontanez,P,Dodgers,,6551,534803,,$-23.99,,,,,,,,,,,,,,,,,,,,,,,,,,,,,,,,,,,3.10
Jeremy Kehrt,P,Dodgers,,7023,543389,,$-23.99,,,,,,,,,,,,,,,,,,,,,,,,,,,,,,,,,,,3.10
Hector Nelo,P,Dodgers,,6997,519075,,$-23.99,,,,,,,,,,,,,,,,,,,,,,,,,,,,,,,,,,,3.10
Jacob Rhame,P,Dodgers,,11089,642008,,$-23.99,,,,,,,,,,,,,,,,,,,,,,,,,,,,,,,,,,,3.10
Mario Santiago,P,Dodgers,,6462,489289,,$-23.99,,,,,,,,,,,,,,,,,,,,,,,,,,,,,,,,,,,3.10
Matt Shelton,P,Dodgers,,10847,,,$-23.99,,,,,,,,,,,,,,,,,,,,,,,,,,,,,,,,,,,3.10
Blake Smith,P,Dodgers,,5345,544930,,$-23.99,,,,,,,,,,,,,,,,,,,,,,,,,,,,,,,,,,,3.10
Steve Smith,P,Dodgers,,7162,545046,,$-23.99,,,,,,,,,,,,,,,,,,,,,,,,,,,,,,,,,,,3.10
Ross Stripling,P,Dodgers,,6580,548389,,$-23.99,,,,,,,,,,,,,,,,,,,,,,,,,,,,,,,,,,,3.10
Scott Van Slyke,1B/CF/LF/RF,Dodgers,,4716,475100,vanslsc01,$-25.49,96,222,53,14,,6,,19,30,3,1,23,2,4,3,1,.239,.316,.383,.308,,,,,,,,,,,,,,,
Scott Schebler,RF,Dodgers,,6564,594988,,$-30.92,19,36,9,,,3,1,6,4,2,1,3,1,1,,,.250,.325,.500,.369,,,,,,,,,,,,,,,
Dillon Moyer,SS,Dodgers,,10947,643464,,$-31.64,,,,,,,,,,,,,,,,,,,,,,,,,,,,,,,,,,,
Angel Sanchez,SS,Dodgers,,148,447816,sanchan02,$-31.64,,,,,,,,,,,,,,,,,,,,,,,,,,,,,,,,,,,
Chris Heisey,LF,Dodgers,,2866,502317,heisech01,$-32.28,33,55,10,2,,2,,8,9,,1,15,2,,2,,.182,.347,.327,.293,,,,,,,,,,,,,,,
Alberto Callaspo,1B/2B/3B/DH,Dodgers,,1392,430948,callaal01,$-32.73,97,230,54,7,,1,1,20,15,,,28,1,,2,1,.235,.314,.278,.278,,,,,,,,,,,,,,,
José Peraza,LF,Dodgers,,6000,606299,,$-33.84,7,22,4,1,1,,,3,1,3,,2,1,,,1,.182,.240,.318,.265,,,,,,,,,,,,,,,
Erisbel Arruebarrena,3B/SS,Dodgers,,7463,628326,,$-35.18,,,,,,,,,,,,,,,,,,,,,,,,,,,,,,,,,,,
Devan Ahart,CF,Dodgers,,10978,,,$-35.44,,,,,,,,,,,,,,,,,,,,,,,,,,,,,,,,,,,
Billy Bereszniewicz,RF,Dodgers,,11161,657512,,$-35.44,,,,,,,,,,,,,,,,,,,,,,,,,,,,,,,,,,,
Deivy Castillo,RF,Dodgers,,11110,,,$-35.44,,,,,,,,,,,,,,,,,,,,,,,,,,,,,,,,,,,
Brian Cavazos-Galvez,LF,Dodgers,,4686,571552,,$-35.44,,,,,,,,,,,,,,,,,,,,,,,,,,,,,,,,,,,
Bobby Coyle,LF,Dodgers,,7166,518578,,$-35.44,,,,,,,,,,,,,,,,,,,,,,,,,,,,,,,,,,,
Joey Curletta,RF,Dodgers,,10871,621575,,$-35.44,,,,,,,,,,,,,,,,,,,,,,,,,,,,,,,,,,,
Robert Garvey,CF,Dodgers,,5371,596840,,$-35.44,,,,,,,,,,,,,,,,,,,,,,,,,,,,,,,,,,,
Jeremy Hazelbaker,LF,Dodgers,,195,571757,,$-35.44,,,,,,,,,,,,,,,,,,,,,,,,,,,,,,,,,,,
Malcolm Holland,LF,Dodgers,,10873,607570,,$-35.44,,,,,,,,,,,,,,,,,,,,,,,,,,,,,,,,,,,
Kyle Jensen,LF,Dodgers,,4944,571812,,$-35.44,,,,,,,,,,,,,,,,,,,,,,,,,,,,,,,,,,,
Peter Lavin,CF,Dodgers,,5865,607332,,$-35.44,,,,,,,,,,,,,,,,,,,,,,,,,,,,,,,,,,,
Michael Medina,RF,Dodgers,,11066,642437,,$-35.44,,,,,,,,,,,,,,,,,,,,,,,,,,,,,,,,,,,
Jeremy Rathjen,LF,Dodgers,,6567,543679,,$-35.44,,,,,,,,,,,,,,,,,,,,,,,,,,,,,,,,,,,
Angelo Songco,LF,Dodgers,,4695,572154,,$-35.44,,,,,,,,,,,,,,,,,,,,,,,,,,,,,,,,,,,
Travis Witherspoon,CF,Dodgers,,5122,573252,,$-35.44,,,,,,,,,,,,,,,,,,,,,,,,,,,,,,,,,,,
Ryan Adams,2B,Dodgers,,443,502031,adamsry01,$-35.46,,,,,,,,,,,,,,,,,,,,,,,,,,,,,,,,,,,
Alfredo Amezaga,2B,Dodgers,,4674,407792,amezaal01,$-35.46,,,,,,,,,,,,,,,,,,,,,,,,,,,,,,,,,,,
Albert Cartwright,2B,Dodgers,,5863,502619,,$-35.46,,,,,,,,,,,,,,,,,,,,,,,,,,,,,,,,,,,
Jarek Cunningham,2B,Dodgers,,5721,543075,,$-35.46,,,,,,,,,,,,,,,,,,,,,,,,,,,,,,,,,,,
Brandon Dixon,2B,Dodgers,,10875,641525,,$-35.46,,,,,,,,,,,,,,,,,,,,,,,,,,,,,,,,,,,
Elliot Johnson,2B,Dodgers,,576,471107,johnsel02,$-35.46,,,,,,,,,,,,,,,,,,,,,,,,,,,,,,,,,,,
Adam Law,2B,Dodgers,,10977,,,$-35.46,,,,,,,,,,,,,,,,,,,,,,,,,,,,,,,,,,,
Omar Luna,2B,Dodgers,,4905,521310,,$-35.46,,,,,,,,,,,,,,,,,,,,,,,,,,,,,,,,,,,
Luis Mateo,2B,Dodgers,,5235,543499,,$-35.46,,,,,,,,,,,,,,,,,,,,,,,,,,,,,,,,,,,
Daniel Mayora,2B,Dodgers,,5112,468452,,$-35.46,,,,,,,,,,,,,,,,,,,,,,,,,,,,,,,,,,,
Nate Samson,2B,Dodgers,,2662,502688,,$-35.46,,,,,,,,,,,,,,,,,,,,,,,,,,,,,,,,,,,
Tyler Wampler,2B,Dodgers,,11065,657795,,$-35.46,,,,,,,,,,,,,,,,,,,,,,,,,,,,,,,,,,,
Lars Anderson,1B,Dodgers,,108,502249,anderla03,$-35.63,,,,,,,,,,,,,,,,,,,,,,,,,,,,,,,,,,,
Aaron Bates,1B,Dodgers,,109,488686,batesaa01,$-35.63,,,,,,,,,,,,,,,,,,,,,,,,,,,,,,,,,,,
Cody Bellinger,1B,Dodgers,,10872,641355,,$-35.63,,,,,,,,,,,,,,,,,,,,,,,,,,,,,,,,,,,
Mike Carp,1B,Dodgers,,4297,455077,carpmi01,$-35.63,,,,,,,,,,,,,,,,,,,,,,,,,,,,,,,,,,,
O`Koyea Dickson,1B,Dodgers,,6565,607297,,$-35.63,,,,,,,,,,,,,,,,,,,,,,,,,,,,,,,,,,,
Kyle Farmer,DH,Dodgers,,9519,571657,,$-35.63,,,,,,,,,,,,,,,,,,,,,,,,,,,,,,,,,,,
Paul Hoenecke,DH,Dodgers,,6996,543320,,$-35.63,,,,,,,,,,,,,,,,,,,,,,,,,,,,,,,,,,,
Julian Leon,DH,Dodgers,,10874,624645,,$-35.63,,,,,,,,,,,,,,,,,,,,,,,,,,,,,,,,,,,
Tyler Ogle,DH,Dodgers,,10957,607365,,$-35.63,,,,,,,,,,,,,,,,,,,,,,,,,,,,,,,,,,,
Andy Wilkins,1B,Dodgers,,6211,519421,,$-35.63,,,,,,,,,,,,,,,,,,,,,,,,,,,,,,,,,,,
Ronald Torreyes,3B,Dodgers,,5262,591720,,$-35.65,8,6,2,1,,,,1,1,,,1,,,,1,.333,.375,.500,.407,,,,,,,,,,,,,,,
Brian Barden,3B,Dodgers,,1984,449471,bardebr01,$-36.21,,,,,,,,,,,,,,,,,,,,,,,,,,,,,,,,,,,
Buck Britton,3B,Dodgers,,5284,542970,,$-36.21,,,,,,,,,,,,,,,,,,,,,,,,,,,,,,,,,,,
Elevys Gonzalez,3B,Dodgers,,6850,,,$-36.21,,,,,,,,,,,,,,,,,,,,,,,,,,,,,,,,,,,
Pedro Guerrero,3B,Dodgers,,6884,463313,,$-36.21,,,,,,,,,,,,,,,,,,,,,,,,,,,,,,,,,,,
Brandon Trinkwon,3B,Dodgers,,11160,643577,,$-36.21,,,,,,,,,,,,,,,,,,,,,,,,,,,,,,,,,,,
James Baldwin,OF,Dodgers,,5343,594743,,$-38.67,,,,,,,,,,,,,,,,,,,,,,,,,,,,,,,,,,,
Jonathan Garcia,OF,Dodgers,,5487,571686,,$-38.67,,,,,,,,,,,,,,,,,,,,,,,,,,,,,,,,,,,
Jacob Scavuzzo,OF,Dodgers,,9430,621468,,$-38.67,,,,,,,,,,,,,,,,,,,,,,,,,,,,,,,,,,,
