Player,Position,ProTeam,RotoTeam,RVid,MLBAMID,BDBID,RotoValue,bG,bAB,bH,b2B,b3B,bHR,bRBOE,bR,bRBI,bSB,bCS,bBB,bIBB,bHBP,bSF,bSH,bAvg,bOBP,bSlg,bwOBA,pG,pIP,pH,pHR,pK,pBB,pIBB,pHB,pER,pWin,pL,pSav,pWHIP,pERA,pFIP
J.T. Realmuto,C,Marlins,Big Chee,5756,592663,,$17.12,141,532,148,31,5,17,3,68,65,8,2,36,4,8,3,,.278,.332,.451,.344,,,,,,,,,,,,,,,
Christian Yelich,CF/LF,Marlins,Big Chee,5764,592885,yelicch01,$17.04,156,602,170,36,2,18,2,100,81,16,2,80,4,6,6,,.282,.369,.439,.361,,,,,,,,,,,,,,,
Justin Bour,1B,Marlins,,2645,571506,,$3.74,108,377,109,18,,25,3,52,83,1,,47,7,1,4,,.289,.366,.536,.388,,,,,,,,,,,,,,,
Starlin Castro,2B,Marlins,Las Vegas Giants,2675,516770,castrst01,$1.00,112,443,133,18,1,16,6,66,63,2,,23,1,4,3,,.300,.338,.454,.357,,,,,,,,,,,,,,,
Derek Dietrich,2B/3B,Marlins,,6087,518618,dietrde01,$-10.67,135,406,101,22,5,13,3,56,53,,1,36,5,18,4,,.249,.334,.424,.333,,,,,,,,,,,,,,,
A.J. Ellis,C,Marlins,,4622,454560,ellisaj01,$-14.97,51,143,30,5,,6,1,17,14,,,12,,6,,2,.210,.294,.371,.303,,,,,,,,,,,,,,,
Tomás Telis,1B/C,Marlins,,6101,542513,,$-20.98,48,104,25,5,3,,1,13,9,,,3,,3,1,,.240,.279,.346,.283,,,,,,,,,,,,,,,
Ramon Cabrera,C,Marlins,,5616,541608,,$-21.60,,,,,,,,,,,,,,,,,,,,,,,,,,,,,,,,,,,
Cam Maron,C,Marlins,,10514,573013,,$-21.60,,,,,,,,,,,,,,,,,,,,,,,,,,,,,,,,,,,
Carlos Paulino,C,Marlins,,4925,544827,,$-21.60,,,,,,,,,,,,,,,,,,,,,,,,,,,,,,,,,,,
Yefri Perez,2B,Marlins,,11122,570639,,$-21.95,,,,,,,,,,,,,,,,,,,,,,,,,,,,,,,,,,,
Chad Wallach,C,Marlins,,10557,595453,,$-22.18,6,11,1,,,,,,,,,,,,,,.091,.091,.091,.082,,,,,,,,,,,,,,,
Steve Lombardozzi,2B,Marlins,,2503,543459,lombast02,$-22.60,2,8,,,,,,,,,,,,,,,,,,,,,,,,,,,,,,,,,
Miguel Rojas,1B/2B/SS,Marlins,,2847,500743,,$-22.97,90,272,79,16,2,1,4,37,26,2,1,27,5,4,2,1,.290,.359,.375,.337,,,,,,,,,,,,,,,
Ichiro Suzuki,RF,Marlins,,4362,400085,suzukic01,$-27.39,136,196,50,6,,3,,19,20,1,1,17,1,1,,1,.255,.316,.332,.291,,,,,,,,,,,,,,,
Tyler Moore,1B,Marlins,,2493,489138,moorety01,$-27.67,104,187,43,14,,6,1,17,30,,,10,,1,4,1,.230,.266,.401,.291,,,,,,,,,,,,,,,
JT Riddle,3B/SS,Marlins,,10125,595375,,$-28.61,70,228,57,13,1,3,2,20,31,,2,12,2,,5,2,.250,.279,.355,.278,,,,,,,,,,,,,,,
Magneuris Sierra,LF,Marlins,,10910,642423,,$-30.84,22,60,19,,,,2,10,5,2,2,4,,,,,.317,.359,.317,.331,,,,,,,,,,,,,,,
Martín Prado,3B,Marlins,Old Hoss,1843,445988,pradoma01,$-31.38,37,140,35,9,,2,,13,12,,,6,,,1,,.250,.279,.357,.279,,,,,,,,,,,,,,,
Brian Anderson,3B,Marlins,,11638,,,$-33.01,25,84,22,7,1,,1,11,8,,,10,,,1,,.262,.337,.369,.325,,,,,,,,,,,,,,,
Garrett Cooper,3B,Marlins,,9475,643265,,$-34.14,13,43,14,5,1,,,3,6,,,1,,,1,,.326,.333,.488,.350,,,,,,,,,,,,,,,
Braxton Lee,CF,Marlins,,11460,657658,,$-35.77,,,,,,,,,,,,,,,,,,,,,,,,,,,,,,,,,,,
Brandon Barnes,LF,Marlins,,3009,488681,barnebr02,$-35.78,,,,,,,,,,,,,,,,,,,,,,,,,,,,,,,,,,,
Destin Hood,LF,Marlins,,2539,543329,,$-35.78,,,,,,,,,,,,,,,,,,,,,,,,,,,,,,,,,,,
Isaac Galloway,RF,Marlins,,2020,543194,,$-36.70,,,,,,,,,,,,,,,,,,,,,,,,,,,,,,,,,,,
Moises Sierra,RF,Marlins,,774,501213,sierrmo01,$-36.70,,,,,,,,,,,,,,,,,,,,,,,,,,,,,,,,,,,
Austin Nola,SS,Marlins,,6937,543592,,$-37.02,,,,,,,,,,,,,,,,,,,,,,,,,,,,,,,,,,,
Mike Aviles,3B/RF/SS,Marlins,,1400,449107,avilemi01,$-37.15,37,86,20,2,,1,1,5,8,,,6,2,2,,3,.233,.289,.291,.271,,,,,,,,,,,,,,,
Matt Juengel,1B,Marlins,,10026,623251,,$-38.04,,,,,,,,,,,,,,,,,,,,,,,,,,,,,,,,,,,
Christian Colón,2B/SS,Marlins,,5201,518568,,$-40.26,24,50,8,1,,,1,4,,,,5,1,,,2,.160,.228,.180,.208,,,,,,,,,,,,,,,
