Player,Position,ProTeam,RotoTeam,RVid,MLBAMID,BDBID,RotoValue,bG,bAB,bH,b2B,b3B,bHR,bTB,bR,bRBI,bSB,bBB,bHBP,bSF,bSH,bAvg,bOBP,pG,pIP,pH,pK,pBB,pER,pWin,pSav,pHld,pS+H,pWHIP,pERA
Shohei Ohtani,DH/SP,Angels,,11942,660271,,$90.07,157,586,160,30,6,34,304,90,95,11,72,5,3,,.273,.356,28,166.00,124,219,44,43,15,,,,1.012,2.33
Aaron Judge,CF/DH/RF,Yankees,,10614,592450,,$65.28,157,570,177,28,,62,391,133,131,16,111,6,5,,.311,.425,,,,,,,,,,,,
Freddie Freeman,1B,Dodgers,,1836,518692,freemfr01,$52.37,159,612,199,47,2,21,313,117,100,13,84,5,7,,.325,.407,,,,,,,,,,,,
Trea Turner,2B/SS,Dodgers,,10635,607208,,$47.47,160,652,194,39,4,21,304,101,100,27,45,3,6,,.298,.343,,,,,,,,,,,,
Paul Goldschmidt,1B/DH,Cardinals,,3648,502671,goldspa01,$46.53,151,561,178,41,,35,324,106,115,7,79,5,4,,.317,.404,,,,,,,,,,,,
José Ramírez,3B/DH,Guardians,,6941,608070,ramirjo01,$40.54,157,601,168,44,5,29,309,90,126,20,69,6,9,,.280,.355,,,,,,,,,,,,
J.T. Realmuto,C,Phillies,,5756,592663,,$39.83,139,504,139,26,5,22,241,75,84,21,41,12,5,,.276,.342,,,,,,,,,,,,
Jose Altuve,2B,Astros,,5507,514888,altuvjo01,$37.24,141,527,158,39,,28,281,103,57,18,66,10,1,,.300,.387,,,,,,,,,,,,
Manny Machado,3B,Padres,,5319,592518,machama01,$35.81,150,578,172,37,1,32,307,100,102,9,63,1,2,,.298,.366,,,,,,,,,,,,
Justin Verlander,SP,Astros,,1186,434378,verlaju01,$33.57,,,,,,,,,,,,,,,,,28,175.00,116,185,29,34,18,,,,0.829,1.75
Pete Alonso,1B/DH,Mets,,12005,624413,,$32.23,160,597,162,27,,40,309,95,131,5,67,12,9,,.271,.352,,,,,,,,,,,,
Yordan Alvarez,DH/LF,Astros,,12011,670541,,$31.62,135,470,144,29,2,37,288,95,97,1,78,6,7,,.306,.406,,,,,,,,,,,,
Francisco Lindor,SS,Mets,,6421,596019,,$31.50,161,630,170,25,5,26,283,98,107,16,59,10,7,,.270,.339,,,,,,,,,,,,
Dansby Swanson,SS,Braves,,11537,621020,,$31.00,162,640,177,32,1,25,286,99,96,18,49,3,4,,.277,.329,,,,,,,,,,,,
Bo Bichette,SS,Blue Jays,,12258,666182,,$30.64,159,652,189,43,1,24,306,91,93,13,41,2,2,,.290,.333,,,,,,,,,,,,
Sandy Alcantara,SP,Marlins,,11419,645261,,$29.31,,,,,,,,,,,,,,,,,32,228.67,174,207,50,58,14,,,,0.980,2.28
Mookie Betts,CF/RF,Dodgers,,7057,605141,,$28.73,142,572,154,40,3,35,305,117,82,12,55,8,4,,.269,.340,,,,,,,,,,,,
Tommy Edman,2B/RF/SS,Cardinals,,12388,669242,,$28.45,153,577,153,31,4,13,231,95,57,32,46,5,1,1,.265,.324,,,,,,,,,,,,
Randy Arozarena,DH/LF/RF,Rays,,12085,668227,,$28.27,153,586,154,41,3,20,261,72,89,32,46,11,2,,.263,.327,,,,,,,,,,,,
Julio Rodríguez,CF,Mariners,,13161,677594,,$28.25,132,511,145,25,3,28,260,84,75,25,40,8,1,,.284,.345,,,,,,,,,,,,
Marcus Semien,2B/SS,Rangers,,5897,543760,semiema01,$27.78,161,657,163,31,5,26,282,101,83,25,53,4,10,,.248,.304,,,,,,,,,,,,
Andrés Giménez,2B/SS,Guardians,,12387,665926,,$27.46,146,491,146,26,3,17,229,66,69,20,34,25,3,4,.297,.368,,,,,,,,,,,,
Xander Bogaerts,SS,Red Sox,,6301,593428,bogaexa01,$26.91,150,557,171,38,,15,254,84,73,8,57,10,7,,.307,.377,,,,,,,,,,,,
Steven Kwan,LF/RF,Guardians,,13364,,,$26.63,147,563,168,25,7,6,225,89,52,19,62,7,4,2,.298,.371,,,,,,,,,,,,
Kyle Tucker,RF,Astros,,11965,663656,,$26.44,150,544,140,28,1,30,260,71,107,25,59,1,2,,.257,.330,,,,,,,,,,,,
Jeff McNeil,2B/DH/LF,Mets,,10691,643446,,$26.42,148,533,174,39,1,9,242,73,62,4,40,11,5,,.326,.382,,,,,,,,,,,,
Nolan Arenado,3B,Cardinals,,5217,571448,arenano01,$26.31,148,557,163,42,1,30,297,73,103,5,52,7,4,,.293,.358,,,,,,,,,,,,
Vladimir Guerrero,1B/DH,Blue Jays,,12256,665489,,$26.25,160,638,175,35,,32,306,90,97,8,58,6,4,,.274,.339,,,,,,,,,,,,
Alek Manoah,SP,Blue Jays,,13563,,,$25.94,,,,,,,,,,,,,,,,,31,196.67,144,180,51,49,16,,,,0.992,2.24
Will Smith,C/DH,Dodgers,,12969,669257,,$25.90,137,508,132,26,3,24,236,68,87,1,56,10,4,,.260,.343,,,,,,,,,,,,
Daulton Varsho,C/CF/RF,Diamondbacks,,10793,662139,,$25.45,151,531,125,23,3,27,235,79,74,16,46,7,5,2,.235,.301,,,,,,,,,,,,
Cedric Mullins,CF,Orioles,,11721,656775,,$25.25,156,608,157,32,4,16,245,89,64,34,47,9,5,1,.258,.318,,,,,,,,,,,,
Julio Urías,SP,Dodgers,,10018,628711,,$25.06,,,,,,,,,,,,,,,,,31,175.00,127,166,41,42,17,,,,0.960,2.16
José Abreu,1B/DH,White Sox,,7346,547989,,$25.01,157,601,183,40,,15,268,85,75,,62,12,4,,.304,.378,,,,,,,,,,,,
Adolis García,CF/DH/RF,Rangers,,12084,666969,,$24.46,156,605,151,34,5,27,276,88,101,25,40,6,6,,.250,.300,,,,,,,,,,,,
Rafael Devers,3B,Red Sox,,11482,646240,,$24.44,141,555,164,42,1,27,289,84,88,3,50,6,3,,.295,.358,,,,,,,,,,,,
Austin Riley,3B/DH,Braves,,11974,663586,,$24.34,159,615,168,39,2,38,325,90,93,2,57,17,4,,.273,.349,,,,,,,,,,,,
Corbin Burnes,SP,Brewers,,12275,669203,,$24.26,,,,,,,,,,,,,,,,,33,202.00,144,243,51,66,12,,,,0.965,2.94
Luis Arraez,1B/2B/3B/DH/LF,Twins,,12358,650333,,$24.14,144,547,173,31,1,8,230,88,49,4,50,3,3,,.316,.375,,,,,,,,,,,,
Dylan Cease,SP,White Sox,,12313,656302,,$23.55,,,,,,,,,,,,,,,,,32,184.00,126,227,78,45,14,,,,1.109,2.20
Yu Darvish,SP,Padres,,5575,506433,darviyu01,$23.50,,,,,,,,,,,,,,,,,30,194.67,148,197,37,67,16,,,,0.950,3.10
Alejandro Kirk,C/DH,Blue Jays,,13066,672386,,$23.37,139,470,134,19,,14,195,59,63,,63,4,4,,.285,.372,,,,,,,,,,,,
Carlos Rodón,SP,Giants,,10466,607074,,$22.58,,,,,,,,,,,,,,,,,31,178.00,131,237,52,57,14,,,,1.028,2.88
Nathaniel Lowe,1B,Rangers,,12115,663993,,$22.22,157,593,179,26,3,27,292,74,76,2,48,4,,,.302,.358,,,,,,,,,,,,
Zac Gallen,SP,Diamondbacks,,12495,668678,,$22.14,,,,,,,,,,,,,,,,,31,184.00,121,192,47,52,12,,,,0.913,2.54
Amed Rosario,SS,Guardians,,10972,642708,,$21.61,153,637,180,26,9,11,257,86,71,18,25,4,4,,.283,.312,,,,,,,,,,,,
Gerrit Cole,SP,Yankees,,5615,543037,colege01,$21.46,,,,,,,,,,,,,,,,,33,200.67,154,257,50,78,13,,,,1.017,3.50
Bobby Witt,3B/SS,Royals,,13509,,,$21.33,150,591,150,31,6,20,253,82,80,30,30,6,5,,.254,.294,,,,,,,,,,,,
Aaron Nola,SP,Phillies,,10644,605400,,$20.97,,,,,,,,,,,,,,,,,32,205.00,168,235,29,74,11,,,,0.961,3.25
Shane McClanahan,SP,Rays,,13122,,,$20.27,,,,,,,,,,,,,,,,,29,166.33,116,194,38,47,12,,,,0.926,2.54
Framber Valdez,SP,Astros,,11653,664285,,$19.94,,,,,,,,,,,,,,,,,31,201.33,166,194,67,63,17,,,,1.157,2.82
Max Fried,SP,Braves,,6318,608331,,$19.90,,,,,,,,,,,,,,,,,30,185.33,156,170,32,51,14,,,,1.014,2.48
Christian Yelich,DH/LF,Brewers,,5764,592885,yelicch01,$19.78,154,575,145,25,4,14,220,99,57,19,88,5,2,1,.252,.355,,,,,,,,,,,,
George Springer,CF/DH/RF,Blue Jays,,5594,543807,,$19.65,133,513,137,22,4,25,242,89,76,14,54,7,5,,.267,.342,,,,,,,,,,,,
Brandon Nimmo,CF/RF,Mets,,5691,607043,,$19.55,151,580,159,30,7,16,251,102,64,3,71,16,3,3,.274,.366,,,,,,,,,,,,
Kyle Wright,SP,Braves,,11979,657140,,$19.31,,,,,,,,,,,,,,,,,30,180.33,156,174,53,64,21,,,,1.159,3.19
Sean Murphy,C/DH,Athletics,,7262,669221,,$19.30,148,537,134,37,2,18,229,67,66,1,56,13,5,,.250,.332,,,,,,,,,,,,
Shane Bieber,SP,Guardians,,12267,669456,,$19.27,,,,,,,,,,,,,,,,,31,200.00,172,198,36,64,13,,,,1.040,2.88
Alex Bregman,3B,Astros,,11366,608324,,$19.05,155,548,142,38,,23,249,93,93,1,87,11,10,,.259,.366,,,,,,,,,,,,
Starling Marte,CF/RF,Mets,,3367,516782,martest01,$18.99,118,466,136,24,5,16,218,76,63,18,26,13,,,.292,.347,,,,,,,,,,,,
Emmanuel Clase,RP,Guardians,,12974,661403,,$18.79,,,,,,,,,,,,,,,,,77,72.67,43,77,10,11,3,42,,42,0.729,1.36
Michael Harris,CF,Braves,,13591,,,$18.51,114,414,123,27,3,19,213,75,64,20,21,5,,1,.297,.338,,,,,,,,,,,,
Mike Trout,CF,Angels,,1710,545361,troutmi01,$18.09,119,438,124,28,2,40,276,85,80,1,54,6,1,,.283,.369,,,,,,,,,,,,
Triston McKenzie,SP,Guardians,,13027,663474,,$18.05,,,,,,,,,,,,,,,,,31,191.33,138,190,44,63,11,,,,0.951,2.96
Juan Soto,RF,Nationals,,12149,665742,,$17.83,153,524,127,25,2,27,237,93,62,6,135,4,,,.242,.401,,,,,,,,,,,,
Ronald Acuña,DH/RF,Braves,,11729,660670,,$17.69,119,467,124,24,,15,193,71,50,29,53,10,3,,.266,.351,,,,,,,,,,,,
Cristian Javier,RP/SP,Astros,,12535,664299,,$17.53,,,,,,,,,,,,,,,,,30,148.67,89,194,52,42,11,,1,1,0.948,2.54
Devin Williams,RP,Brewers,,12975,642207,,$17.48,,,,,,,,,,,,,,,,,65,60.67,31,96,30,13,6,15,26,41,1.005,1.93
Tyler Anderson,SP,Dodgers,,6306,542881,,$17.48,,,,,,,,,,,,,,,,,30,178.67,145,138,34,51,15,,,,1.002,2.57
Nestor Cortes,SP,Yankees,,11955,641482,,$17.37,,,,,,,,,,,,,,,,,28,158.33,108,163,38,43,12,,,,0.922,2.44
Tony Gonsolin,SP,Dodgers,,12961,664062,,$17.20,,,,,,,,,,,,,,,,,24,130.33,79,119,35,31,16,,,,0.875,2.14
Ryan Helsley,RP,Cardinals,,12231,664854,,$16.92,,,,,,,,,,,,,,,,,54,64.67,28,94,20,9,9,19,7,26,0.742,1.25
Max Scherzer,SP,Mets,,1184,453286,scherma01,$16.88,,,,,,,,,,,,,,,,,23,145.33,108,173,24,37,11,,,,0.908,2.29
A.J. Minter,RP,Braves,,11866,621345,,$16.86,,,,,,,,,,,,,,,,,75,70.00,49,94,15,16,5,5,34,39,0.914,2.06
Willson Contreras,C/DH,Cubs,,6038,575929,,$16.77,113,416,101,23,2,22,194,65,55,4,45,24,2,,.243,.349,,,,,,,,,,,,
Adley Rutschman,C/DH,Orioles,,13081,,,$16.67,113,398,101,35,1,13,177,70,42,4,65,4,3,,.254,.362,,,,,,,,,,,,
Josh Rojas,2B/3B/RF/SS,Diamondbacks,,12193,668942,,$16.55,125,443,119,25,1,9,173,66,56,23,55,2,5,5,.269,.345,,,,,,,,,,,,
Edwin Díaz,RP,Mets,,11518,621242,,$16.47,,,,,,,,,,,,,,,,,61,62.00,34,118,18,9,3,32,4,36,0.839,1.31
Brandon Drury,1B/2B/3B/DH,Reds,,5891,592273,,$15.93,138,518,136,31,2,28,255,87,87,2,38,8,4,,.263,.320,,,,,,,,,,,,
Kyle Schwarber,DH/LF,Phillies,,10616,656941,,$15.78,155,577,126,21,3,46,291,100,94,10,86,4,2,,.218,.323,,,,,,,,,,,,
Spencer Strider,RP/SP,Braves,,13864,,,$15.75,,,,,,,,,,,,,,,,,31,131.67,86,202,45,39,11,,2,2,0.995,2.67
Thairo Estrada,2B/SS,Giants,,11616,642731,,$15.50,140,488,127,22,2,14,195,71,62,21,33,14,5,1,.260,.322,,,,,,,,,,,,
Ian Happ,CF/LF,Cubs,,11673,664023,,$15.25,158,573,155,42,2,17,252,72,72,9,58,6,4,,.271,.342,,,,,,,,,,,,
Nico Hoerner,2B/SS,Cubs,,12640,663538,,$15.23,135,481,135,22,5,10,197,60,55,20,28,6,2,,.281,.327,,,,,,,,,,,,
Yandy Díaz,1B/3B,Rays,,10071,650490,,$14.86,137,473,140,33,,9,200,71,57,3,78,6,1,,.296,.401,,,,,,,,,,,,
Travis d'Arnaud,C,Braves,,723,518595,darnatr01,$14.22,107,396,106,25,1,18,187,61,60,,19,11,,,.268,.319,,,,,,,,,,,,
Logan Webb,SP,Giants,,12346,657277,,$14.10,,,,,,,,,,,,,,,,,32,192.33,174,163,49,62,15,,,,1.159,2.90
Brandon Woodruff,SP,Brewers,,11850,605540,,$13.93,,,,,,,,,,,,,,,,,27,153.33,122,190,42,52,13,,,,1.070,3.05
Ty France,1B/2B/DH,Mariners,,12331,664034,,$13.76,140,551,151,27,1,20,240,65,83,,35,21,5,,.274,.338,,,,,,,,,,,,
Matt Olson,1B,Braves,,9384,621566,,$13.53,162,616,148,44,,34,294,86,103,,75,4,4,,.240,.325,,,,,,,,,,,,
Jake Cronenworth,1B/2B/SS,Padres,,12444,630105,,$13.45,158,587,140,30,4,17,229,88,88,3,70,16,8,,.239,.332,,,,,,,,,,,,
Taylor Ward,LF/RF,Angels,,11351,621493,,$13.37,135,495,139,22,2,23,234,73,65,5,60,4,5,,.281,.360,,,,,,,,,,,,
Carlos Correa,SS,Twins,,6438,621043,,$13.31,136,522,152,24,1,22,244,70,64,,61,3,4,,.291,.366,,,,,,,,,,,,
Jordan Romano,RP,Blue Jays,,12379,605447,,$13.23,,,,,,,,,,,,,,,,,63,64.00,44,73,21,15,5,36,3,39,1.016,2.11
William Contreras,C/DH,Braves,,12394,661388,,$13.05,97,334,93,14,1,20,169,51,45,2,39,1,2,,.278,.354,,,,,,,,,,,,
Gleyber Torres,2B/SS,Yankees,,10684,650402,,$12.99,140,526,135,28,1,24,237,73,76,10,39,3,3,1,.257,.309,,,,,,,,,,,,
Kenley Jansen,RP,Braves,,4575,445276,janseke01,$12.59,,,,,,,,,,,,,,,,,65,64.00,45,85,22,24,5,41,,41,1.047,3.38
Christian Walker,1B,Diamondbacks,,6465,572233,,$12.30,160,583,141,25,2,36,278,84,94,2,69,8,7,,.242,.327,,,,,,,,,,,,
Zack Wheeler,SP,Phillies,,5491,554430,wheelza01,$12.28,,,,,,,,,,,,,,,,,26,153.00,125,163,34,48,12,,,,1.039,2.82
C.J. Cron,1B/DH,Rockies,,6756,543068,,$12.22,150,575,148,28,3,29,269,79,102,,43,8,5,,.257,.315,,,,,,,,,,,,
Clayton Kershaw,SP,Dodgers,,4603,477132,kershcl01,$12.18,,,,,,,,,,,,,,,,,22,126.33,96,137,23,32,12,,,,0.942,2.28
Miles Mikolas,SP,Cardinals,,5624,571945,mikolmi01,$12.16,,,,,,,,,,,,,,,,,33,202.33,170,153,39,74,12,,,,1.033,3.29
Salvador Perez,C/DH,Royals,,5081,521692,perezsa02,$12.08,114,445,113,23,1,23,207,48,76,,18,7,3,,.254,.292,,,,,,,,,,,,
Joe Musgrove,SP,Padres,,11305,605397,,$12.06,,,,,,,,,,,,,,,,,30,181.00,154,184,42,59,10,,,,1.083,2.93
Scott Barlow,RP,Royals,,11941,605130,,$11.97,,,,,,,,,,,,,,,,,69,74.33,52,77,22,18,7,24,6,30,0.996,2.18
Rafael Montero,RP,Astros,,6241,606160,,$11.94,,,,,,,,,,,,,,,,,71,68.33,47,73,23,18,5,14,23,37,1.024,2.37
Josh Bell,1B/DH,Nationals,,6324,605137,,$11.80,156,552,147,29,3,17,233,78,71,,81,5,6,,.266,.362,,,,,,,,,,,,
Daniel Bard,RP,Rockies,,31,453268,bardda01,$11.72,,,,,,,,,,,,,,,,,57,60.33,35,69,25,12,6,34,,34,0.994,1.79
Chris Bassitt,SP,Mets,,7432,605135,,$11.53,,,,,,,,,,,,,,,,,30,181.67,159,167,49,69,15,,,,1.145,3.42
Merrill Kelly,SP,Diamondbacks,,6935,518876,,$11.42,,,,,,,,,,,,,,,,,33,200.33,167,177,61,75,13,,,,1.138,3.37
Bryan Reynolds,CF,Pirates,,12646,668804,,$11.40,145,542,142,19,4,27,250,74,62,7,56,14,2,,.262,.345,,,,,,,,,,,,
Alex Verdugo,CF/LF/RF,Red Sox,,11451,657077,,$11.04,152,593,166,39,1,11,240,75,74,1,42,3,6,,.280,.328,,,,,,,,,,,,
Corey Seager,SS,Rangers,,6429,608369,,$10.82,151,593,145,24,1,33,270,91,83,3,58,7,5,,.245,.317,,,,,,,,,,,,
Willy Adames,SS,Brewers,,11563,642715,,$10.76,139,563,134,31,,31,258,83,98,8,49,1,4,,.238,.298,,,,,,,,,,,,
Bryce Harper,DH/RF,Phillies,,5074,547180,harpebr03,$10.71,99,370,106,28,1,18,190,63,65,11,46,3,7,,.286,.364,,,,,,,,,,,,
Evan Phillips,RP,Dodgers,,11800,623465,,$10.38,,,,,,,,,,,,,,,,,64,63.00,33,77,15,8,7,2,19,21,0.762,1.14
Logan Gilbert,SP,Mariners,,13324,669302,,$10.35,,,,,,,,,,,,,,,,,32,185.67,170,174,49,66,13,,,,1.180,3.20
Rhys Hoskins,1B,Phillies,,11705,656555,,$10.33,156,589,145,33,2,30,272,81,79,2,72,6,4,,.246,.332,,,,,,,,,,,,
Liam Hendriks,RP,White Sox,,5513,521230,hendrli01,$10.11,,,,,,,,,,,,,,,,,58,57.67,44,85,16,18,4,37,,37,1.040,2.81
Andrew Benintendi,LF,Royals,,11492,643217,,$10.02,126,461,140,23,3,5,184,54,51,8,52,2,5,1,.304,.372,,,,,,,,,,,,
Alec Bohm,3B,Phillies,,13069,664761,,$9.88,152,586,164,24,3,13,233,79,72,2,31,4,10,,.280,.315,,,,,,,,,,,,
Jon Berti,2B/3B,Marlins,,11350,,,$9.58,102,358,86,17,3,4,121,47,28,41,42,3,1,,.240,.324,,,,,,,,,,,,
Robbie Ray,SP,Mariners,,7387,592662,,$9.47,,,,,,,,,,,,,,,,,32,189.00,163,212,62,78,12,,,,1.190,3.71
Teoscar Hernández,DH/LF/RF,Blue Jays,,9446,606192,,$9.45,131,499,133,35,1,25,245,71,77,6,34,2,,,.267,.316,,,,,,,,,,,,
Justin Turner,3B/DH,Dodgers,,446,457759,turneju01,$9.28,128,468,130,36,,13,205,61,81,3,50,6,8,,.278,.350,,,,,,,,,,,,
Kolten Wong,2B,Brewers,,5622,543939,wongko01,$9.27,134,430,108,24,4,15,185,65,47,17,46,14,5,2,.251,.338,,,,,,,,,,,,
Kevin Gausman,SP,Blue Jays,,6316,592332,gausmke01,$9.24,,,,,,,,,,,,,,,,,31,174.67,188,205,28,65,12,,,,1.237,3.35
Jason Adam,RP,Rays,,7279,592094,,$8.96,,,,,,,,,,,,,,,,,67,63.33,31,75,17,11,2,8,22,30,0.758,1.56
Alexis Díaz,RP/SP,Reds,,13880,,,$8.77,,,,,,,,,,,,,,,,,59,63.67,28,83,33,13,7,10,13,23,0.958,1.84
Christian Vázquez,C,Red Sox,,5299,543877,,$8.75,119,398,109,23,,9,159,41,52,1,22,3,3,,.274,.315,,,,,,,,,,,,
Luis Garcia,SP,Astros,,13434,677651,,$8.74,,,,,,,,,,,,,,,,,28,157.33,131,157,47,65,15,,,,1.131,3.72
Paul Sewald,RP,Mariners,,11841,623149,,$8.72,,,,,,,,,,,,,,,,,65,64.00,32,72,17,19,5,20,8,28,0.766,2.67
Martín Pérez,SP,Rangers,,5486,527048,perezma02,$8.64,,,,,,,,,,,,,,,,,32,196.33,178,169,69,63,12,,,,1.258,2.89
Félix Bautista,RP/SP,Orioles,,13912,,,$8.50,,,,,,,,,,,,,,,,,65,65.67,38,88,23,16,4,15,13,28,0.929,2.19
J.D. Martinez,DH/LF,Red Sox,,5186,502110,martijd02,$8.42,139,533,146,43,1,16,239,76,62,,52,5,5,,.274,.341,,,,,,,,,,,,
Ryan McMahon,2B/3B,Rockies,,10706,641857,,$8.14,153,529,130,23,3,20,219,67,67,7,60,5,3,,.246,.327,,,,,,,,,,,,
MJ Melendez,C/DH/LF,Royals,,12569,669004,,$8.06,129,460,100,21,3,18,181,57,62,2,66,1,7,,.217,.313,,,,,,,,,,,,
John Schreiber,RP,Red Sox,,12152,670167,,$7.66,,,,,,,,,,,,,,,,,64,65.00,45,74,19,16,4,8,22,30,0.985,2.22
Clay Holmes,RP,Yankees,,11585,605280,,$7.35,,,,,,,,,,,,,,,,,62,63.67,45,65,20,18,7,20,7,27,1.021,2.54
Drew Rasmussen,RP/SP,Rays,,13225,656876,,$7.32,,,,,,,,,,,,,,,,,28,146.00,121,125,31,46,11,,,,1.041,2.84
Joe Ryan,SP,Twins,,13064,,,$7.21,,,,,,,,,,,,,,,,,27,147.00,115,151,47,58,13,,,,1.102,3.55
Whit Merrifield,2B/RF,Royals,,5926,593160,,$7.17,139,504,125,28,1,11,188,70,58,16,38,,8,,.248,.296,,,,,,,,,,,,
Ha-Seong Kim,2B/3B/SS,Padres,,13670,,,$7.15,150,517,130,29,3,11,198,58,59,12,51,7,4,3,.251,.323,,,,,,,,,,,,
Anthony Santander,DH/LF/RF,Orioles,,11612,623993,,$7.02,152,574,138,24,,33,261,78,89,,55,13,5,,.240,.318,,,,,,,,,,,,
Brendan Rodgers,2B/SS,Rockies,,12539,663898,,$7.00,137,527,140,30,3,13,215,72,63,,46,3,5,,.266,.325,,,,,,,,,,,,
Jeffrey Springs,RP/SP,Rays,,12283,605488,,$6.99,,,,,,,,,,,,,,,,,33,135.33,114,144,31,37,9,,,,1.071,2.46
Mark Canha,CF/LF/RF,Mets,,5757,592192,,$6.81,140,462,123,24,,13,186,71,61,3,48,28,4,,.266,.367,,,,,,,,,,,,
Jameson Taillon,SP,Yankees,,6300,592791,,$6.79,,,,,,,,,,,,,,,,,32,177.33,168,151,32,77,14,,,,1.128,3.91
Adam Cimber,RP,Blue Jays,,11968,643256,,$6.74,,,,,,,,,,,,,,,,,77,70.67,66,58,13,22,10,4,19,23,1.118,2.80
Cal Quantrill,SP,Guardians,,12633,615698,,$6.66,,,,,,,,,,,,,,,,,32,186.33,178,128,47,70,15,,,,1.208,3.38
Eugenio Suárez,3B/SS,Mariners,,5905,553993,,$6.62,150,543,128,24,2,31,249,76,87,,73,8,5,,.236,.332,,,,,,,,,,,,
DJ LeMahieu,1B/2B/3B,Yankees,,2658,518934,lemahdj01,$6.61,125,467,122,18,,12,176,74,46,4,67,4,2,1,.261,.357,,,,,,,,,,,,
Brendan Donovan,2B/3B/RF,Cardinals,,13886,,,$6.54,126,391,110,21,1,5,148,64,45,2,60,14,2,1,.281,.393,,,,,,,,,,,,
Adam Ottavino,RP,Mets,,3473,493603,ottavad01,$6.45,,,,,,,,,,,,,,,,,66,65.67,48,79,16,15,6,3,19,22,0.975,2.06
Elvis Andrus,SS,Athletics,,4483,462101,andruel01,$6.42,149,535,133,32,,17,216,66,58,18,39,3,,,.249,.303,,,,,,,,,,,,
Raisel Iglesias,RP,Angels,,10452,628452,,$6.35,,,,,,,,,,,,,,,,,67,62.00,46,78,14,17,2,17,15,32,0.968,2.47
Luis Castillo,SP,Reds,,10548,622491,,$6.34,,,,,,,,,,,,,,,,,25,150.33,118,167,45,50,8,,,,1.084,2.99
Isiah Kiner-Falefa,SS,Yankees,,11645,643396,,$6.19,142,483,126,20,,4,158,66,48,22,35,5,5,3,.261,.313,,,,,,,,,,,,
Cionel Pérez,RP,Orioles,,11902,672335,,$6.16,,,,,,,,,,,,,,,,,66,57.67,46,55,21,9,7,1,25,26,1.162,1.40
Camilo Doval,RP,Giants,,13615,,,$6.13,,,,,,,,,,,,,,,,,68,67.67,54,80,30,19,6,27,1,28,1.241,2.53
Gio Urshela,3B/SS,Twins,,6416,570482,,$6.11,144,501,143,27,3,13,215,61,64,1,41,2,7,,.285,.338,,,,,,,,,,,,
Héctor Neris,RP,Astros,,5862,593576,,$5.97,,,,,,,,,,,,,,,,,70,65.33,49,79,17,27,6,3,25,28,1.010,3.72
Jhoan Duran,RP/SP,Twins,,13034,,,$5.78,,,,,,,,,,,,,,,,,57,67.67,50,89,16,14,2,8,18,26,0.975,1.86
Andrés Muñoz,RP,Mariners,,12966,662253,,$5.72,,,,,,,,,,,,,,,,,64,65.00,43,96,15,18,2,4,22,26,0.892,2.49
Gavin Lux,2B/LF/SS,Dodgers,,12174,666158,,$5.62,129,421,116,20,7,6,168,66,42,7,47,,3,,.276,.346,,,,,,,,,,,,
Anthony Bass,RP,Marlins,,5098,542914,bassan01,$5.52,,,,,,,,,,,,,,,,,73,70.33,51,73,20,12,4,,23,23,1.009,1.54
Jake McCarthy,CF/DH/LF/RF,Diamondbacks,,13454,,,$5.46,99,321,91,16,3,8,137,53,43,23,23,6,1,3,.283,.339,,,,,,,,,,,,
Ryan Pressly,RP,Astros,,6297,519151,pressry01,$5.42,,,,,,,,,,,,,,,,,50,48.33,30,65,13,16,3,33,,33,0.890,2.98
Jordan Montgomery,SP,Yankees,,11741,656756,,$5.33,,,,,,,,,,,,,,,,,32,178.33,159,158,36,69,9,,,,1.093,3.48
Anthony Rizzo,1B,Yankees,,113,519203,rizzoan01,$5.33,130,465,104,21,1,32,223,77,75,6,58,23,2,,.224,.338,,,,,,,,,,,,
Jurickson Profar,1B/CF/LF/RF,Padres,,5170,595777,profaju01,$5.03,152,575,140,36,2,15,225,82,58,5,73,4,3,3,.243,.330,,,,,,,,,,,,
Charlie Blackmon,DH/RF,Rockies,,5147,453568,blackch02,$4.81,135,530,140,22,6,16,222,60,78,4,32,8,3,4,.264,.312,,,,,,,,,,,,
Brady Singer,SP,Royals,,13148,663903,,$4.70,,,,,,,,,,,,,,,,,27,153.33,140,150,35,55,10,,,,1.141,3.23
Joc Pederson,CF/LF/RF,Giants,,5344,592626,,$4.58,134,380,104,19,3,23,198,57,70,3,42,7,4,,.274,.353,,,,,,,,,,,,
Ross Stripling,RP/SP,Blue Jays,,6580,548389,,$4.49,,,,,,,,,,,,,,,,,32,134.33,117,111,20,45,10,1,,1,1.020,3.01
Jorge Mateo,OF/SS,Orioles,,11352,622761,,$4.38,150,494,109,25,7,13,187,63,50,35,27,5,2,3,.221,.266,,,,,,,,,,,,
Pablo López,SP,Marlins,,11925,641154,,$4.34,,,,,,,,,,,,,,,,,32,180.00,157,174,53,75,10,,,,1.167,3.75
Ryan Mountcastle,1B/DH/LF,Orioles,,11789,663624,,$4.33,145,555,139,28,1,22,235,62,85,4,43,4,7,,.250,.305,,,,,,,,,,,,
Tommy Pham,LF,Reds,,3549,502054,,$4.28,144,554,131,23,1,17,207,89,63,8,56,7,5,,.236,.312,,,,,,,,,,,,
Taylor Rogers,RP,Padres,,10541,573124,,$4.21,,,,,,,,,,,,,,,,,66,64.33,57,84,19,34,4,31,4,35,1.181,4.76
Matt Chapman,3B,Blue Jays,,11357,656305,,$3.96,155,538,123,27,1,27,233,83,76,2,68,10,5,,.229,.324,,,,,,,,,,,,
Jeremy Peña,SS,Astros,,12675,,,$3.89,136,521,132,20,2,22,222,72,63,11,22,6,5,1,.253,.288,,,,,,,,,,,,
Andrew Vaughn,1B/DH/LF/RF,White Sox,,13192,,,$3.86,134,510,138,28,1,17,219,60,76,,31,9,5,,.271,.321,,,,,,,,,,,,
Jonah Heim,C,Rangers,,10927,641680,,$3.67,127,406,92,20,1,16,162,51,48,2,41,1,2,,.227,.298,,,,,,,,,,,,
Keibert Ruiz,C,Nationals,,11779,660688,,$3.65,112,394,99,22,,7,142,33,36,6,30,6,2,1,.251,.312,,,,,,,,,,,,
Brad Boxberger,RP,Brewers,,5420,502202,boxbebr01,$3.63,,,,,,,,,,,,,,,,,70,64.00,52,68,27,21,4,1,30,31,1.234,2.95
Cal Raleigh,C,Mariners,,12416,663728,,$3.46,119,370,78,20,1,27,181,46,63,1,38,2,5,,.211,.284,,,,,,,,,,,,
Trevor Stephan,RP/SP,Guardians,,12435,,,$3.25,,,,,,,,,,,,,,,,,66,63.67,57,82,18,19,6,3,19,22,1.178,2.69
Matt Moore,RP/SP,Rangers,,5518,519043,moorema02,$2.88,,,,,,,,,,,,,,,,,63,74.00,49,83,38,16,5,5,14,19,1.176,1.95
Taijuan Walker,SP,Mets,,5602,592836,walketa01,$2.86,,,,,,,,,,,,,,,,,29,157.33,143,132,45,61,12,,,,1.195,3.49
Griffin Jax,RP/SP,Twins,,13137,,,$2.80,,,,,,,,,,,,,,,,,65,72.33,56,78,20,27,7,1,18,19,1.051,3.36
José Urquidy,SP,Astros,,12964,664353,,$2.72,,,,,,,,,,,,,,,,,29,164.33,154,134,38,72,13,,,,1.168,3.94
Eric Haase,C/LF,Tigers,,10012,606992,,$2.72,110,323,82,17,1,14,143,41,44,,24,1,3,,.254,.305,,,,,,,,,,,,
Kyle Finnegan,RP,Nationals,,12098,640448,,$2.70,,,,,,,,,,,,,,,,,66,66.67,54,70,22,26,6,11,14,25,1.140,3.51
Brock Burke,RP/SP,Rangers,,12353,656271,,$2.40,,,,,,,,,,,,,,,,,52,82.33,63,90,24,18,7,,9,9,1.057,1.97
Eric Lauer,SP,Brewers,,12017,641778,,$2.37,,,,,,,,,,,,,,,,,29,158.67,135,157,59,65,11,,,,1.223,3.69
Carlos Carrasco,SP,Mets,,1015,471911,carraca01,$2.28,,,,,,,,,,,,,,,,,29,152.00,161,152,41,67,15,,,,1.329,3.97
David Robertson,RP,Cubs,,242,502085,roberda08,$2.26,,,,,,,,,,,,,,,,,58,63.67,39,81,35,17,4,20,3,23,1.162,2.40
Luis Robert,CF,White Sox,,11988,673357,,$2.20,98,380,108,18,,12,162,54,56,11,17,3,1,,.284,.319,,,,,,,,,,,,
Kyle Farmer,3B/SS,Reds,,9519,571657,,$2.19,145,526,134,25,1,14,203,58,78,4,33,16,6,2,.255,.314,,,,,,,,,,,,
Austin Nola,C,Padres,,6937,543592,,$2.17,110,347,87,15,,4,114,40,40,2,34,6,9,1,.251,.320,,,,,,,,,,,,
Brooks Raley,RP,Rays,,6138,548384,raleybr01,$2.15,,,,,,,,,,,,,,,,,60,53.67,37,61,15,16,1,6,25,31,0.969,2.68
Lourdes Gurriel,LF,Blue Jays,,11549,666971,,$2.14,121,453,132,32,1,5,181,52,52,3,31,6,2,,.291,.343,,,,,,,,,,,,
Danny Jansen,C,Blue Jays,,11917,643376,,$2.07,72,215,56,10,,15,111,34,44,1,25,3,5,,.260,.339,,,,,,,,,,,,
Giovanny Gallegos,RP,Cardinals,,11578,606149,,$2.01,,,,,,,,,,,,,,,,,57,59.00,42,73,18,20,3,14,12,26,1.017,3.05
Josh Naylor,1B/DH/LF/RF,Guardians,,11973,647304,,$1.98,122,449,115,28,,20,203,47,79,6,38,6,5,,.256,.319,,,,,,,,,,,,
Ketel Marte,2B/CF/DH,Diamondbacks,,6003,606466,,$1.96,137,492,118,42,2,12,200,68,52,5,55,6,5,,.240,.321,,,,,,,,,,,,
Jorge López,RP/SP,Orioles,,10923,605347,,$1.95,,,,,,,,,,,,,,,,,67,71.00,53,72,31,20,4,23,1,24,1.183,2.54
Trevor Story,2B/SS,Red Sox,,6508,596115,,$1.88,94,357,85,22,,16,155,53,66,13,32,3,4,,.238,.303,,,,,,,,,,,,
Javier Báez,2B/SS,Tigers,,6040,595879,,$1.86,144,555,132,27,4,17,218,64,67,9,26,6,3,,.238,.278,,,,,,,,,,,,
Alex Lange,RP/SP,Tigers,,13589,,,$1.85,,,,,,,,,,,,,,,,,71,63.33,47,82,31,24,7,,21,21,1.232,3.41
Hunter Renfroe,RF,Brewers,,10146,592669,,$1.80,125,474,121,23,1,29,233,62,72,1,39,4,3,2,.255,.314,,,,,,,,,,,,
Seranthony Domínguez,RP,Phillies,,11888,622554,,$1.68,,,,,,,,,,,,,,,,,54,51.00,36,61,22,17,6,9,15,24,1.137,3.00
Blake Snell,SP,Padres,,11275,605483,,$1.55,,,,,,,,,,,,,,,,,25,128.00,103,171,51,48,8,,,,1.203,3.38
Jose Miranda,1B/2B/3B/DH,Twins,,13708,,,$1.49,125,444,119,25,,15,189,45,66,1,28,10,1,,.268,.325,,,,,,,,,,,,
Andrew McCutchen,DH/LF,Brewers,,3354,457705,mccutan01,$1.44,134,515,122,25,,17,198,66,69,8,57,4,4,,.237,.316,,,,,,,,,,,,
Colin Poche,RP,Rays,,12478,621363,,$1.43,,,,,,,,,,,,,,,,,65,58.67,46,64,22,26,4,7,23,30,1.159,3.99
Wilmer Flores,1B/2B/3B/DH,Giants,,2165,527038,florewi01,$1.34,151,525,120,28,1,19,207,72,71,,59,11,7,,.229,.316,,,,,,,,,,,,